{"text_format":"3","workbook":"xlsx","n_sheets":3,"sheets":["Megrendelés","Bútorlapok","Élzárók"],"not_rendered":{"images":1,"macros":1,"external_links":1,"defined_names":7},"read":"whole","date_system":"1900"}

{"sheet":"Megrendelés","index":0,"n_rows":106,"n_cols":15,"rows_kept":106,"merged":[[0,0,0,1],[0,2,0,5],[1,0,1,1],[1,2,1,5],[2,0,2,1],[2,2,2,5],[3,0,3,1],[3,2,3,5],[4,0,4,1],[4,2,4,5],[5,0,5,1],[5,2,5,5],[6,0,6,5],[6,6,6,9],[6,10,6,13],[6,14,7,14]]}
["Megrendelő neve*:"]
["Számlázási címe*:"]
["Elérhetősége telefon*:"]
["Email:"]
["Szállítási határidő*:"]
["Szállítási raklapot kér (igen/nem):"]
["Bútorlap",{"$nulls":5},"Élzárás 0,4 mm vastagságban",{"$nulls":3},"Élzárás 2 mm vastagságban",{"$nulls":3},"Kitöltési hibák"]
["Azonosító","Megnevezés","Hosszúság (mm)","Szélesség (mm)","Mennyiség (darab)","Megjegyzés","Hossz. él (0,1,2) (darab)","Szél. él (0,1,2) (darab)","Azonosító","Megnevezés","Hossz. él (0,1,2) (darab)","Szél. él (0,1,2) (darab)","Azonosító","Megnevezés"]
["40300",{"$f":"IFERROR(VLOOKUP(A9,Bútorlapok!$A:$B,2),\"\")","v":"40300 Borovi tábla HT A/A"},1000,2000,11,null,1,1,"5499009 22x04",{"$f":"IFERROR(VLOOKUP(I9,Élzárók!$A:$B,2),\"\")","v":"ABS5499009 22x04"},1,1,"54990009 22x2",{"$f":"IFERROR(VLOOKUP(M9,Élzárók!$A:$B,2),\"\")","v":"ABS5499009 22x2"},{"$f":"IF(G9+H9+K9+L9>4,\"Az élzárások össz darabszáma maximum 4 lehet!\",\"\")","v":""}]
["40315",{"$f":"IFERROR(VLOOKUP(A10,Bútorlapok!$A:$B,2),\"\")","v":"40315 Borovi Tábla HT A/Akevert"},100,200,22,null,1,1,"5499035 22x04",{"$f":"IFERROR(VLOOKUP(I10,Élzárók!$A:$B,2),\"\")","v":"ABS5499035 22x0,4"},1,1,"5499031 22x2",{"$f":"IFERROR(VLOOKUP(M10,Élzárók!$A:$B,2),\"\")","v":"ABS5499031 22×0,4"},{"$f":"IF(G10+H10+K10+L10>4,\"Az élzárások össz darabszáma maximum 4 lehet!\",\"\")","v":""}]
["54721",{"$f":"IFERROR(VLOOKUP(A11,Bútorlapok!$A:$B,2),\"\")","v":"54721 Forgácslap Szürke PE-II"},500,500,10,null,1,2,"ABS5472122x04",{"$f":"IFERROR(VLOOKUP(I11,Élzárók!$A:$B,2),\"\")","v":"ABS54721 22x04 98463"},1,null,"ABS54721 42x2",{"$f":"IFERROR(VLOOKUP(M11,Élzárók!$A:$B,2),\"\")","v":"ABS54721 42x2"},{"$f":"IF(G11+H11+K11+L11>4,\"Az élzárások össz darabszáma maximum 4 lehet!\",\"\")","v":""}]
["",{"$f":"IFERROR(VLOOKUP(A12,Bútorlapok!$A:$B,2),\"\")","v":""},{"$nulls":6},"",{"$f":"IFERROR(VLOOKUP(I12,Élzárók!$A:$B,2),\"\")","v":""},null,null,"",{"$f":"IFERROR(VLOOKUP(M12,Élzárók!$A:$B,2),\"\")","v":""},{"$f":"IF(G12+H12+K12+L12>4,\"Az élzárások össz darabszáma maximum 4 lehet!\",\"\")","v":""}]
[null,{"$f":"IFERROR(VLOOKUP(A13,Bútorlapok!$A:$B,2),\"\")","v":""},{"$nulls":7},{"$f":"IFERROR(VLOOKUP(I13,Élzárók!$A:$B,2),\"\")","v":""},{"$nulls":3},{"$f":"IFERROR(VLOOKUP(M13,Élzárók!$A:$B,2),\"\")","v":""}]
[null,{"$f":"IFERROR(VLOOKUP(A14,Bútorlapok!$A:$B,2),\"\")","v":""},{"$nulls":7},{"$f":"IFERROR(VLOOKUP(I14,Élzárók!$A:$B,2),\"\")","v":""},null,null,"",{"$f":"IFERROR(VLOOKUP(M14,Élzárók!$A:$B,2),\"\")","v":""}]
[null,{"$f":"IFERROR(VLOOKUP(A15,Bútorlapok!$A:$B,2),\"\")","v":""},{"$nulls":7},{"$f":"IFERROR(VLOOKUP(I15,Élzárók!$A:$B,2),\"\")","v":""},null,null,"",{"$f":"IFERROR(VLOOKUP(M15,Élzárók!$A:$B,2),\"\")","v":""}]
[null,{"$f":"IFERROR(VLOOKUP(A16,Bútorlapok!$A:$B,2),\"\")","v":""},{"$nulls":7},{"$f":"IFERROR(VLOOKUP(I16,Élzárók!$A:$B,2),\"\")","v":""},{"$nulls":3},{"$f":"IFERROR(VLOOKUP(M16,Élzárók!$A:$B,2),\"\")","v":""}]
[null,{"$f":"IFERROR(VLOOKUP(A17,Bútorlapok!$A:$B,2),\"\")","v":""},{"$nulls":7},{"$f":"IFERROR(VLOOKUP(I17,Élzárók!$A:$B,2),\"\")","v":""},{"$nulls":3},{"$f":"IFERROR(VLOOKUP(M17,Élzárók!$A:$B,2),\"\")","v":""}]
[null,{"$f":"IFERROR(VLOOKUP(A18,Bútorlapok!$A:$B,2),\"\")","v":""},{"$nulls":7},{"$f":"IFERROR(VLOOKUP(I18,Élzárók!$A:$B,2),\"\")","v":""},null,null,"",{"$f":"IFERROR(VLOOKUP(M18,Élzárók!$A:$B,2),\"\")","v":""}]
[null,{"$f":"IFERROR(VLOOKUP(A19,Bútorlapok!$A:$B,2),\"\")","v":""},{"$nulls":7},{"$f":"IFERROR(VLOOKUP(I19,Élzárók!$A:$B,2),\"\")","v":""},{"$nulls":3},{"$f":"IFERROR(VLOOKUP(M19,Élzárók!$A:$B,2),\"\")","v":""}]
[null,{"$f":"IFERROR(VLOOKUP(A20,Bútorlapok!$A:$B,2),\"\")","v":""},{"$nulls":7},{"$f":"IFERROR(VLOOKUP(I20,Élzárók!$A:$B,2),\"\")","v":""},{"$nulls":3},{"$f":"IFERROR(VLOOKUP(M20,Élzárók!$A:$B,2),\"\")","v":""}]
[null,{"$f":"IFERROR(VLOOKUP(A21,Bútorlapok!$A:$B,2),\"\")","v":""},{"$nulls":7},{"$f":"IFERROR(VLOOKUP(I21,Élzárók!$A:$B,2),\"\")","v":""},{"$nulls":3},{"$f":"IFERROR(VLOOKUP(M21,Élzárók!$A:$B,2),\"\")","v":""}]
[null,{"$f":"IFERROR(VLOOKUP(A22,Bútorlapok!$A:$B,2),\"\")","v":""},{"$nulls":7},{"$f":"IFERROR(VLOOKUP(I22,Élzárók!$A:$B,2),\"\")","v":""},{"$nulls":3},{"$f":"IFERROR(VLOOKUP(M22,Élzárók!$A:$B,2),\"\")","v":""}]
[null,{"$f":"IFERROR(VLOOKUP(A23,Bútorlapok!$A:$B,2),\"\")","v":""},{"$nulls":7},{"$f":"IFERROR(VLOOKUP(I23,Élzárók!$A:$B,2),\"\")","v":""},{"$nulls":3},{"$f":"IFERROR(VLOOKUP(M23,Élzárók!$A:$B,2),\"\")","v":""}]
[null,{"$f":"IFERROR(VLOOKUP(A24,Bútorlapok!$A:$B,2),\"\")","v":""},{"$nulls":7},{"$f":"IFERROR(VLOOKUP(I24,Élzárók!$A:$B,2),\"\")","v":""},{"$nulls":3},{"$f":"IFERROR(VLOOKUP(M24,Élzárók!$A:$B,2),\"\")","v":""}]
["",{"$f":"IFERROR(VLOOKUP(A25,Bútorlapok!$A:$B,2),\"\")","v":""},{"$nulls":7},{"$f":"IFERROR(VLOOKUP(I25,Élzárók!$A:$B,2),\"\")","v":""},{"$nulls":3},{"$f":"IFERROR(VLOOKUP(M25,Élzárók!$A:$B,2),\"\")","v":""}]
["",{"$f":"IFERROR(VLOOKUP(A26,Bútorlapok!$A:$B,2),\"\")","v":""},{"$nulls":7},{"$f":"IFERROR(VLOOKUP(I26,Élzárók!$A:$B,2),\"\")","v":""},{"$nulls":3},{"$f":"IFERROR(VLOOKUP(M26,Élzárók!$A:$B,2),\"\")","v":""}]
["",{"$f":"IFERROR(VLOOKUP(A27,Bútorlapok!$A:$B,2),\"\")","v":""},{"$nulls":7},{"$f":"IFERROR(VLOOKUP(I27,Élzárók!$A:$B,2),\"\")","v":""},{"$nulls":3},{"$f":"IFERROR(VLOOKUP(M27,Élzárók!$A:$B,2),\"\")","v":""}]
["",{"$f":"IFERROR(VLOOKUP(A28,Bútorlapok!$A:$B,2),\"\")","v":""},{"$nulls":7},{"$f":"IFERROR(VLOOKUP(I28,Élzárók!$A:$B,2),\"\")","v":""},{"$nulls":3},{"$f":"IFERROR(VLOOKUP(M28,Élzárók!$A:$B,2),\"\")","v":""}]
["",{"$f":"IFERROR(VLOOKUP(A29,Bútorlapok!$A:$B,2),\"\")","v":""},{"$nulls":7},{"$f":"IFERROR(VLOOKUP(I29,Élzárók!$A:$B,2),\"\")","v":""},{"$nulls":3},{"$f":"IFERROR(VLOOKUP(M29,Élzárók!$A:$B,2),\"\")","v":""}]
["",{"$f":"IFERROR(VLOOKUP(A30,Bútorlapok!$A:$B,2),\"\")","v":""},{"$nulls":7},{"$f":"IFERROR(VLOOKUP(I30,Élzárók!$A:$B,2),\"\")","v":""},{"$nulls":3},{"$f":"IFERROR(VLOOKUP(M30,Élzárók!$A:$B,2),\"\")","v":""}]
[null,{"$f":"IFERROR(VLOOKUP(A31,Bútorlapok!$A:$B,2),\"\")","v":""},{"$nulls":7},{"$f":"IFERROR(VLOOKUP(I31,Élzárók!$A:$B,2),\"\")","v":""},{"$nulls":3},{"$f":"IFERROR(VLOOKUP(M31,Élzárók!$A:$B,2),\"\")","v":""}]
["",{"$f":"IFERROR(VLOOKUP(A32,Bútorlapok!$A:$B,2),\"\")","v":""},{"$nulls":7},{"$f":"IFERROR(VLOOKUP(I32,Élzárók!$A:$B,2),\"\")","v":""},{"$nulls":3},{"$f":"IFERROR(VLOOKUP(M32,Élzárók!$A:$B,2),\"\")","v":""}]
[null,{"$f":"IFERROR(VLOOKUP(A33,Bútorlapok!$A:$B,2),\"\")","v":""},{"$nulls":7},{"$f":"IFERROR(VLOOKUP(I33,Élzárók!$A:$B,2),\"\")","v":""},{"$nulls":3},{"$f":"IFERROR(VLOOKUP(M33,Élzárók!$A:$B,2),\"\")","v":""}]
[null,{"$f":"IFERROR(VLOOKUP(A34,Bútorlapok!$A:$B,2),\"\")","v":""},{"$nulls":7},{"$f":"IFERROR(VLOOKUP(I34,Élzárók!$A:$B,2),\"\")","v":""},{"$nulls":3},{"$f":"IFERROR(VLOOKUP(M34,Élzárók!$A:$B,2),\"\")","v":""}]
[null,{"$f":"IFERROR(VLOOKUP(A35,Bútorlapok!$A:$B,2),\"\")","v":""},{"$nulls":7},{"$f":"IFERROR(VLOOKUP(I35,Élzárók!$A:$B,2),\"\")","v":""},{"$nulls":3},{"$f":"IFERROR(VLOOKUP(M35,Élzárók!$A:$B,2),\"\")","v":""}]
[null,{"$f":"IFERROR(VLOOKUP(A36,Bútorlapok!$A:$B,2),\"\")","v":""},{"$nulls":7},{"$f":"IFERROR(VLOOKUP(I36,Élzárók!$A:$B,2),\"\")","v":""},{"$nulls":3},{"$f":"IFERROR(VLOOKUP(M36,Élzárók!$A:$B,2),\"\")","v":""}]
[null,{"$f":"IFERROR(VLOOKUP(A37,Bútorlapok!$A:$B,2),\"\")","v":""},{"$nulls":7},{"$f":"IFERROR(VLOOKUP(I37,Élzárók!$A:$B,2),\"\")","v":""},{"$nulls":3},{"$f":"IFERROR(VLOOKUP(M37,Élzárók!$A:$B,2),\"\")","v":""}]
[null,{"$f":"IFERROR(VLOOKUP(A38,Bútorlapok!$A:$B,2),\"\")","v":""},{"$nulls":7},{"$f":"IFERROR(VLOOKUP(I38,Élzárók!$A:$B,2),\"\")","v":""},{"$nulls":3},{"$f":"IFERROR(VLOOKUP(M38,Élzárók!$A:$B,2),\"\")","v":""}]
[null,{"$f":"IFERROR(VLOOKUP(A39,Bútorlapok!$A:$B,2),\"\")","v":""},{"$nulls":7},{"$f":"IFERROR(VLOOKUP(I39,Élzárók!$A:$B,2),\"\")","v":""},{"$nulls":3},{"$f":"IFERROR(VLOOKUP(M39,Élzárók!$A:$B,2),\"\")","v":""}]
[null,{"$f":"IFERROR(VLOOKUP(A40,Bútorlapok!$A:$B,2),\"\")","v":""},{"$nulls":7},{"$f":"IFERROR(VLOOKUP(I40,Élzárók!$A:$B,2),\"\")","v":""},{"$nulls":3},{"$f":"IFERROR(VLOOKUP(M40,Élzárók!$A:$B,2),\"\")","v":""}]
[null,{"$f":"IFERROR(VLOOKUP(A41,Bútorlapok!$A:$B,2),\"\")","v":""},{"$nulls":7},{"$f":"IFERROR(VLOOKUP(I41,Élzárók!$A:$B,2),\"\")","v":""},{"$nulls":3},{"$f":"IFERROR(VLOOKUP(M41,Élzárók!$A:$B,2),\"\")","v":""}]
[null,{"$f":"IFERROR(VLOOKUP(A42,Bútorlapok!$A:$B,2),\"\")","v":""},{"$nulls":7},{"$f":"IFERROR(VLOOKUP(I42,Élzárók!$A:$B,2),\"\")","v":""},{"$nulls":3},{"$f":"IFERROR(VLOOKUP(M42,Élzárók!$A:$B,2),\"\")","v":""}]
[null,{"$f":"IFERROR(VLOOKUP(A43,Bútorlapok!$A:$B,2),\"\")","v":""},{"$nulls":7},{"$f":"IFERROR(VLOOKUP(I43,Élzárók!$A:$B,2),\"\")","v":""},{"$nulls":3},{"$f":"IFERROR(VLOOKUP(M43,Élzárók!$A:$B,2),\"\")","v":""}]
[null,{"$f":"IFERROR(VLOOKUP(A44,Bútorlapok!$A:$B,2),\"\")","v":""},{"$nulls":7},{"$f":"IFERROR(VLOOKUP(I44,Élzárók!$A:$B,2),\"\")","v":""},{"$nulls":3},{"$f":"IFERROR(VLOOKUP(M44,Élzárók!$A:$B,2),\"\")","v":""}]
[null,{"$f":"IFERROR(VLOOKUP(A45,Bútorlapok!$A:$B,2),\"\")","v":""},{"$nulls":7},{"$f":"IFERROR(VLOOKUP(I45,Élzárók!$A:$B,2),\"\")","v":""},{"$nulls":3},{"$f":"IFERROR(VLOOKUP(M45,Élzárók!$A:$B,2),\"\")","v":""}]
[null,{"$f":"IFERROR(VLOOKUP(A46,Bútorlapok!$A:$B,2),\"\")","v":""},{"$nulls":7},{"$f":"IFERROR(VLOOKUP(I46,Élzárók!$A:$B,2),\"\")","v":""},{"$nulls":3},{"$f":"IFERROR(VLOOKUP(M46,Élzárók!$A:$B,2),\"\")","v":""}]
[null,{"$f":"IFERROR(VLOOKUP(A47,Bútorlapok!$A:$B,2),\"\")","v":""},{"$nulls":7},{"$f":"IFERROR(VLOOKUP(I47,Élzárók!$A:$B,2),\"\")","v":""},{"$nulls":3},{"$f":"IFERROR(VLOOKUP(M47,Élzárók!$A:$B,2),\"\")","v":""}]
[null,{"$f":"IFERROR(VLOOKUP(A48,Bútorlapok!$A:$B,2),\"\")","v":""},{"$nulls":7},{"$f":"IFERROR(VLOOKUP(I48,Élzárók!$A:$B,2),\"\")","v":""},{"$nulls":3},{"$f":"IFERROR(VLOOKUP(M48,Élzárók!$A:$B,2),\"\")","v":""}]
[null,{"$f":"IFERROR(VLOOKUP(A49,Bútorlapok!$A:$B,2),\"\")","v":""},{"$nulls":7},{"$f":"IFERROR(VLOOKUP(I49,Élzárók!$A:$B,2),\"\")","v":""},{"$nulls":3},{"$f":"IFERROR(VLOOKUP(M49,Élzárók!$A:$B,2),\"\")","v":""}]
[null,{"$f":"IFERROR(VLOOKUP(A50,Bútorlapok!$A:$B,2),\"\")","v":""},{"$nulls":7},{"$f":"IFERROR(VLOOKUP(I50,Élzárók!$A:$B,2),\"\")","v":""},{"$nulls":3},{"$f":"IFERROR(VLOOKUP(M50,Élzárók!$A:$B,2),\"\")","v":""}]
[null,{"$f":"IFERROR(VLOOKUP(A51,Bútorlapok!$A:$B,2),\"\")","v":""},{"$nulls":7},{"$f":"IFERROR(VLOOKUP(I51,Élzárók!$A:$B,2),\"\")","v":""},{"$nulls":3},{"$f":"IFERROR(VLOOKUP(M51,Élzárók!$A:$B,2),\"\")","v":""}]
[null,{"$f":"IFERROR(VLOOKUP(A52,Bútorlapok!$A:$B,2),\"\")","v":""},{"$nulls":7},{"$f":"IFERROR(VLOOKUP(I52,Élzárók!$A:$B,2),\"\")","v":""},{"$nulls":3},{"$f":"IFERROR(VLOOKUP(M52,Élzárók!$A:$B,2),\"\")","v":""}]
[null,{"$f":"IFERROR(VLOOKUP(A53,Bútorlapok!$A:$B,2),\"\")","v":""},{"$nulls":7},{"$f":"IFERROR(VLOOKUP(I53,Élzárók!$A:$B,2),\"\")","v":""},{"$nulls":3},{"$f":"IFERROR(VLOOKUP(M53,Élzárók!$A:$B,2),\"\")","v":""}]
[null,{"$f":"IFERROR(VLOOKUP(A54,Bútorlapok!$A:$B,2),\"\")","v":""},{"$nulls":7},{"$f":"IFERROR(VLOOKUP(I54,Élzárók!$A:$B,2),\"\")","v":""},{"$nulls":3},{"$f":"IFERROR(VLOOKUP(M54,Élzárók!$A:$B,2),\"\")","v":""}]
[null,{"$f":"IFERROR(VLOOKUP(A55,Bútorlapok!$A:$B,2),\"\")","v":""},{"$nulls":7},{"$f":"IFERROR(VLOOKUP(I55,Élzárók!$A:$B,2),\"\")","v":""},{"$nulls":3},{"$f":"IFERROR(VLOOKUP(M55,Élzárók!$A:$B,2),\"\")","v":""}]
[null,{"$f":"IFERROR(VLOOKUP(A56,Bútorlapok!$A:$B,2),\"\")","v":""},{"$nulls":7},{"$f":"IFERROR(VLOOKUP(I56,Élzárók!$A:$B,2),\"\")","v":""},{"$nulls":3},{"$f":"IFERROR(VLOOKUP(M56,Élzárók!$A:$B,2),\"\")","v":""}]
[null,{"$f":"IFERROR(VLOOKUP(A57,Bútorlapok!$A:$B,2),\"\")","v":""},{"$nulls":7},{"$f":"IFERROR(VLOOKUP(I57,Élzárók!$A:$B,2),\"\")","v":""},{"$nulls":3},{"$f":"IFERROR(VLOOKUP(M57,Élzárók!$A:$B,2),\"\")","v":""}]
[null,{"$f":"IFERROR(VLOOKUP(A58,Bútorlapok!$A:$B,2),\"\")","v":""},{"$nulls":7},{"$f":"IFERROR(VLOOKUP(I58,Élzárók!$A:$B,2),\"\")","v":""},{"$nulls":3},{"$f":"IFERROR(VLOOKUP(M58,Élzárók!$A:$B,2),\"\")","v":""}]
[null,{"$f":"IFERROR(VLOOKUP(A59,Bútorlapok!$A:$B,2),\"\")","v":""},{"$nulls":7},{"$f":"IFERROR(VLOOKUP(I59,Élzárók!$A:$B,2),\"\")","v":""},{"$nulls":3},{"$f":"IFERROR(VLOOKUP(M59,Élzárók!$A:$B,2),\"\")","v":""}]
[null,{"$f":"IFERROR(VLOOKUP(A60,Bútorlapok!$A:$B,2),\"\")","v":""},{"$nulls":7},{"$f":"IFERROR(VLOOKUP(I60,Élzárók!$A:$B,2),\"\")","v":""},{"$nulls":3},{"$f":"IFERROR(VLOOKUP(M60,Élzárók!$A:$B,2),\"\")","v":""}]
[null,{"$f":"IFERROR(VLOOKUP(A61,Bútorlapok!$A:$B,2),\"\")","v":""},{"$nulls":7},{"$f":"IFERROR(VLOOKUP(I61,Élzárók!$A:$B,2),\"\")","v":""},{"$nulls":3},{"$f":"IFERROR(VLOOKUP(M61,Élzárók!$A:$B,2),\"\")","v":""}]
[null,{"$f":"IFERROR(VLOOKUP(A62,Bútorlapok!$A:$B,2),\"\")","v":""},{"$nulls":7},{"$f":"IFERROR(VLOOKUP(I62,Élzárók!$A:$B,2),\"\")","v":""},{"$nulls":3},{"$f":"IFERROR(VLOOKUP(M62,Élzárók!$A:$B,2),\"\")","v":""}]
[null,{"$f":"IFERROR(VLOOKUP(A63,Bútorlapok!$A:$B,2),\"\")","v":""},{"$nulls":7},{"$f":"IFERROR(VLOOKUP(I63,Élzárók!$A:$B,2),\"\")","v":""},{"$nulls":3},{"$f":"IFERROR(VLOOKUP(M63,Élzárók!$A:$B,2),\"\")","v":""}]
[null,{"$f":"IFERROR(VLOOKUP(A64,Bútorlapok!$A:$B,2),\"\")","v":""},{"$nulls":7},{"$f":"IFERROR(VLOOKUP(I64,Élzárók!$A:$B,2),\"\")","v":""},{"$nulls":3},{"$f":"IFERROR(VLOOKUP(M64,Élzárók!$A:$B,2),\"\")","v":""}]
[null,{"$f":"IFERROR(VLOOKUP(A65,Bútorlapok!$A:$B,2),\"\")","v":""},{"$nulls":7},{"$f":"IFERROR(VLOOKUP(I65,Élzárók!$A:$B,2),\"\")","v":""},{"$nulls":3},{"$f":"IFERROR(VLOOKUP(M65,Élzárók!$A:$B,2),\"\")","v":""}]
[null,{"$f":"IFERROR(VLOOKUP(A66,Bútorlapok!$A:$B,2),\"\")","v":""},{"$nulls":7},{"$f":"IFERROR(VLOOKUP(I66,Élzárók!$A:$B,2),\"\")","v":""},{"$nulls":3},{"$f":"IFERROR(VLOOKUP(M66,Élzárók!$A:$B,2),\"\")","v":""}]
[null,{"$f":"IFERROR(VLOOKUP(A67,Bútorlapok!$A:$B,2),\"\")","v":""},{"$nulls":7},{"$f":"IFERROR(VLOOKUP(I67,Élzárók!$A:$B,2),\"\")","v":""},{"$nulls":3},{"$f":"IFERROR(VLOOKUP(M67,Élzárók!$A:$B,2),\"\")","v":""}]
[null,{"$f":"IFERROR(VLOOKUP(A68,Bútorlapok!$A:$B,2),\"\")","v":""},{"$nulls":7},{"$f":"IFERROR(VLOOKUP(I68,Élzárók!$A:$B,2),\"\")","v":""},{"$nulls":3},{"$f":"IFERROR(VLOOKUP(M68,Élzárók!$A:$B,2),\"\")","v":""}]
[null,{"$f":"IFERROR(VLOOKUP(A69,Bútorlapok!$A:$B,2),\"\")","v":""},{"$nulls":7},{"$f":"IFERROR(VLOOKUP(I69,Élzárók!$A:$B,2),\"\")","v":""},{"$nulls":3},{"$f":"IFERROR(VLOOKUP(M69,Élzárók!$A:$B,2),\"\")","v":""}]
[null,{"$f":"IFERROR(VLOOKUP(A70,Bútorlapok!$A:$B,2),\"\")","v":""},{"$nulls":7},{"$f":"IFERROR(VLOOKUP(I70,Élzárók!$A:$B,2),\"\")","v":""},{"$nulls":3},{"$f":"IFERROR(VLOOKUP(M70,Élzárók!$A:$B,2),\"\")","v":""}]
[null,{"$f":"IFERROR(VLOOKUP(A71,Bútorlapok!$A:$B,2),\"\")","v":""},{"$nulls":7},{"$f":"IFERROR(VLOOKUP(I71,Élzárók!$A:$B,2),\"\")","v":""},{"$nulls":3},{"$f":"IFERROR(VLOOKUP(M71,Élzárók!$A:$B,2),\"\")","v":""}]
[null,{"$f":"IFERROR(VLOOKUP(A72,Bútorlapok!$A:$B,2),\"\")","v":""},{"$nulls":7},{"$f":"IFERROR(VLOOKUP(I72,Élzárók!$A:$B,2),\"\")","v":""},{"$nulls":3},{"$f":"IFERROR(VLOOKUP(M72,Élzárók!$A:$B,2),\"\")","v":""}]
[null,{"$f":"IFERROR(VLOOKUP(A73,Bútorlapok!$A:$B,2),\"\")","v":""},{"$nulls":7},{"$f":"IFERROR(VLOOKUP(I73,Élzárók!$A:$B,2),\"\")","v":""},{"$nulls":3},{"$f":"IFERROR(VLOOKUP(M73,Élzárók!$A:$B,2),\"\")","v":""}]
[null,{"$f":"IFERROR(VLOOKUP(A74,Bútorlapok!$A:$B,2),\"\")","v":""},{"$nulls":7},{"$f":"IFERROR(VLOOKUP(I74,Élzárók!$A:$B,2),\"\")","v":""},{"$nulls":3},{"$f":"IFERROR(VLOOKUP(M74,Élzárók!$A:$B,2),\"\")","v":""}]
[null,{"$f":"IFERROR(VLOOKUP(A75,Bútorlapok!$A:$B,2),\"\")","v":""},{"$nulls":7},{"$f":"IFERROR(VLOOKUP(I75,Élzárók!$A:$B,2),\"\")","v":""},{"$nulls":3},{"$f":"IFERROR(VLOOKUP(M75,Élzárók!$A:$B,2),\"\")","v":""}]
[null,{"$f":"IFERROR(VLOOKUP(A76,Bútorlapok!$A:$B,2),\"\")","v":""},{"$nulls":7},{"$f":"IFERROR(VLOOKUP(I76,Élzárók!$A:$B,2),\"\")","v":""},{"$nulls":3},{"$f":"IFERROR(VLOOKUP(M76,Élzárók!$A:$B,2),\"\")","v":""}]
[null,{"$f":"IFERROR(VLOOKUP(A77,Bútorlapok!$A:$B,2),\"\")","v":""},{"$nulls":7},{"$f":"IFERROR(VLOOKUP(I77,Élzárók!$A:$B,2),\"\")","v":""},{"$nulls":3},{"$f":"IFERROR(VLOOKUP(M77,Élzárók!$A:$B,2),\"\")","v":""}]
[null,{"$f":"IFERROR(VLOOKUP(A78,Bútorlapok!$A:$B,2),\"\")","v":""},{"$nulls":7},{"$f":"IFERROR(VLOOKUP(I78,Élzárók!$A:$B,2),\"\")","v":""},{"$nulls":3},{"$f":"IFERROR(VLOOKUP(M78,Élzárók!$A:$B,2),\"\")","v":""}]
[null,{"$f":"IFERROR(VLOOKUP(A79,Bútorlapok!$A:$B,2),\"\")","v":""},{"$nulls":7},{"$f":"IFERROR(VLOOKUP(I79,Élzárók!$A:$B,2),\"\")","v":""},{"$nulls":3},{"$f":"IFERROR(VLOOKUP(M79,Élzárók!$A:$B,2),\"\")","v":""}]
[null,{"$f":"IFERROR(VLOOKUP(A80,Bútorlapok!$A:$B,2),\"\")","v":""},{"$nulls":7},{"$f":"IFERROR(VLOOKUP(I80,Élzárók!$A:$B,2),\"\")","v":""},{"$nulls":3},{"$f":"IFERROR(VLOOKUP(M80,Élzárók!$A:$B,2),\"\")","v":""}]
[null,{"$f":"IFERROR(VLOOKUP(A81,Bútorlapok!$A:$B,2),\"\")","v":""},{"$nulls":7},{"$f":"IFERROR(VLOOKUP(I81,Élzárók!$A:$B,2),\"\")","v":""},{"$nulls":3},{"$f":"IFERROR(VLOOKUP(M81,Élzárók!$A:$B,2),\"\")","v":""}]
[null,{"$f":"IFERROR(VLOOKUP(A82,Bútorlapok!$A:$B,2),\"\")","v":""},{"$nulls":7},{"$f":"IFERROR(VLOOKUP(I82,Élzárók!$A:$B,2),\"\")","v":""},{"$nulls":3},{"$f":"IFERROR(VLOOKUP(M82,Élzárók!$A:$B,2),\"\")","v":""}]
[null,{"$f":"IFERROR(VLOOKUP(A83,Bútorlapok!$A:$B,2),\"\")","v":""},{"$nulls":7},{"$f":"IFERROR(VLOOKUP(I83,Élzárók!$A:$B,2),\"\")","v":""},{"$nulls":3},{"$f":"IFERROR(VLOOKUP(M83,Élzárók!$A:$B,2),\"\")","v":""}]
[null,{"$f":"IFERROR(VLOOKUP(A84,Bútorlapok!$A:$B,2),\"\")","v":""},{"$nulls":7},{"$f":"IFERROR(VLOOKUP(I84,Élzárók!$A:$B,2),\"\")","v":""},{"$nulls":3},{"$f":"IFERROR(VLOOKUP(M84,Élzárók!$A:$B,2),\"\")","v":""}]
[null,{"$f":"IFERROR(VLOOKUP(A85,Bútorlapok!$A:$B,2),\"\")","v":""},{"$nulls":7},{"$f":"IFERROR(VLOOKUP(I85,Élzárók!$A:$B,2),\"\")","v":""},{"$nulls":3},{"$f":"IFERROR(VLOOKUP(M85,Élzárók!$A:$B,2),\"\")","v":""}]
[null,{"$f":"IFERROR(VLOOKUP(A86,Bútorlapok!$A:$B,2),\"\")","v":""},{"$nulls":7},{"$f":"IFERROR(VLOOKUP(I86,Élzárók!$A:$B,2),\"\")","v":""},{"$nulls":3},{"$f":"IFERROR(VLOOKUP(M86,Élzárók!$A:$B,2),\"\")","v":""}]
[null,{"$f":"IFERROR(VLOOKUP(A87,Bútorlapok!$A:$B,2),\"\")","v":""},{"$nulls":7},{"$f":"IFERROR(VLOOKUP(I87,Élzárók!$A:$B,2),\"\")","v":""},{"$nulls":3},{"$f":"IFERROR(VLOOKUP(M87,Élzárók!$A:$B,2),\"\")","v":""}]
[null,{"$f":"IFERROR(VLOOKUP(A88,Bútorlapok!$A:$B,2),\"\")","v":""},{"$nulls":7},{"$f":"IFERROR(VLOOKUP(I88,Élzárók!$A:$B,2),\"\")","v":""},{"$nulls":3},{"$f":"IFERROR(VLOOKUP(M88,Élzárók!$A:$B,2),\"\")","v":""}]
[null,{"$f":"IFERROR(VLOOKUP(A89,Bútorlapok!$A:$B,2),\"\")","v":""},{"$nulls":7},{"$f":"IFERROR(VLOOKUP(I89,Élzárók!$A:$B,2),\"\")","v":""},{"$nulls":3},{"$f":"IFERROR(VLOOKUP(M89,Élzárók!$A:$B,2),\"\")","v":""}]
[null,{"$f":"IFERROR(VLOOKUP(A90,Bútorlapok!$A:$B,2),\"\")","v":""},{"$nulls":7},{"$f":"IFERROR(VLOOKUP(I90,Élzárók!$A:$B,2),\"\")","v":""},{"$nulls":3},{"$f":"IFERROR(VLOOKUP(M90,Élzárók!$A:$B,2),\"\")","v":""}]
[null,{"$f":"IFERROR(VLOOKUP(A91,Bútorlapok!$A:$B,2),\"\")","v":""},{"$nulls":7},{"$f":"IFERROR(VLOOKUP(I91,Élzárók!$A:$B,2),\"\")","v":""},{"$nulls":3},{"$f":"IFERROR(VLOOKUP(M91,Élzárók!$A:$B,2),\"\")","v":""}]
[null,{"$f":"IFERROR(VLOOKUP(A92,Bútorlapok!$A:$B,2),\"\")","v":""},{"$nulls":7},{"$f":"IFERROR(VLOOKUP(I92,Élzárók!$A:$B,2),\"\")","v":""},{"$nulls":3},{"$f":"IFERROR(VLOOKUP(M92,Élzárók!$A:$B,2),\"\")","v":""}]
[null,{"$f":"IFERROR(VLOOKUP(A93,Bútorlapok!$A:$B,2),\"\")","v":""},{"$nulls":7},{"$f":"IFERROR(VLOOKUP(I93,Élzárók!$A:$B,2),\"\")","v":""},{"$nulls":3},{"$f":"IFERROR(VLOOKUP(M93,Élzárók!$A:$B,2),\"\")","v":""}]
[null,{"$f":"IFERROR(VLOOKUP(A94,Bútorlapok!$A:$B,2),\"\")","v":""},{"$nulls":7},{"$f":"IFERROR(VLOOKUP(I94,Élzárók!$A:$B,2),\"\")","v":""},{"$nulls":3},{"$f":"IFERROR(VLOOKUP(M94,Élzárók!$A:$B,2),\"\")","v":""}]
[null,{"$f":"IFERROR(VLOOKUP(A95,Bútorlapok!$A:$B,2),\"\")","v":""},{"$nulls":7},{"$f":"IFERROR(VLOOKUP(I95,Élzárók!$A:$B,2),\"\")","v":""},{"$nulls":3},{"$f":"IFERROR(VLOOKUP(M95,Élzárók!$A:$B,2),\"\")","v":""}]
[null,{"$f":"IFERROR(VLOOKUP(A96,Bútorlapok!$A:$B,2),\"\")","v":""},{"$nulls":7},{"$f":"IFERROR(VLOOKUP(I96,Élzárók!$A:$B,2),\"\")","v":""},{"$nulls":3},{"$f":"IFERROR(VLOOKUP(M96,Élzárók!$A:$B,2),\"\")","v":""}]
[null,{"$f":"IFERROR(VLOOKUP(A97,Bútorlapok!$A:$B,2),\"\")","v":""},{"$nulls":7},{"$f":"IFERROR(VLOOKUP(I97,Élzárók!$A:$B,2),\"\")","v":""},{"$nulls":3},{"$f":"IFERROR(VLOOKUP(M97,Élzárók!$A:$B,2),\"\")","v":""}]
[null,{"$f":"IFERROR(VLOOKUP(A98,Bútorlapok!$A:$B,2),\"\")","v":""},{"$nulls":7},{"$f":"IFERROR(VLOOKUP(I98,Élzárók!$A:$B,2),\"\")","v":""},{"$nulls":3},{"$f":"IFERROR(VLOOKUP(M98,Élzárók!$A:$B,2),\"\")","v":""}]
[null,{"$f":"IFERROR(VLOOKUP(A99,Bútorlapok!$A:$B,2),\"\")","v":""},{"$nulls":7},{"$f":"IFERROR(VLOOKUP(I99,Élzárók!$A:$B,2),\"\")","v":""},{"$nulls":3},{"$f":"IFERROR(VLOOKUP(M99,Élzárók!$A:$B,2),\"\")","v":""}]
[null,{"$f":"IFERROR(VLOOKUP(A100,Bútorlapok!$A:$B,2),\"\")","v":""},{"$nulls":7},{"$f":"IFERROR(VLOOKUP(I100,Élzárók!$A:$B,2),\"\")","v":""},{"$nulls":3},{"$f":"IFERROR(VLOOKUP(M100,Élzárók!$A:$B,2),\"\")","v":""}]
[null,{"$f":"IFERROR(VLOOKUP(A101,Bútorlapok!$A:$B,2),\"\")","v":""},{"$nulls":7},{"$f":"IFERROR(VLOOKUP(I101,Élzárók!$A:$B,2),\"\")","v":""},{"$nulls":3},{"$f":"IFERROR(VLOOKUP(M101,Élzárók!$A:$B,2),\"\")","v":""}]
[null,{"$f":"IFERROR(VLOOKUP(A102,Bútorlapok!$A:$B,2),\"\")","v":""},{"$nulls":7},{"$f":"IFERROR(VLOOKUP(I102,Élzárók!$A:$B,2),\"\")","v":""},{"$nulls":3},{"$f":"IFERROR(VLOOKUP(M102,Élzárók!$A:$B,2),\"\")","v":""}]
[null,{"$f":"IFERROR(VLOOKUP(A103,Bútorlapok!$A:$B,2),\"\")","v":""},{"$nulls":7},{"$f":"IFERROR(VLOOKUP(I103,Élzárók!$A:$B,2),\"\")","v":""},{"$nulls":3},{"$f":"IFERROR(VLOOKUP(M103,Élzárók!$A:$B,2),\"\")","v":""}]
[null,{"$f":"IFERROR(VLOOKUP(A104,Bútorlapok!$A:$B,2),\"\")","v":""},{"$nulls":7},{"$f":"IFERROR(VLOOKUP(I104,Élzárók!$A:$B,2),\"\")","v":""},{"$nulls":3},{"$f":"IFERROR(VLOOKUP(M104,Élzárók!$A:$B,2),\"\")","v":""}]
[null,{"$f":"IFERROR(VLOOKUP(A105,Bútorlapok!$A:$B,2),\"\")","v":""},{"$nulls":7},{"$f":"IFERROR(VLOOKUP(I105,Élzárók!$A:$B,2),\"\")","v":""},{"$nulls":3},{"$f":"IFERROR(VLOOKUP(M105,Élzárók!$A:$B,2),\"\")","v":""}]
[null,{"$f":"IFERROR(VLOOKUP(A106,Bútorlapok!$A:$B,2),\"\")","v":""},{"$nulls":7},{"$f":"IFERROR(VLOOKUP(I106,Élzárók!$A:$B,2),\"\")","v":""},{"$nulls":3},{"$f":"IFERROR(VLOOKUP(M106,Élzárók!$A:$B,2),\"\")","v":""}]

{"sheet":"Bútorlapok","index":1,"n_rows":768,"n_cols":19,"rows_kept":768,"hidden":true}
["2970","Nyír rétegelt lemez csuszásmentes",2500,1250,27,"NEM",0,0,0,0,0,0,0,0,0,null,0,null,2970]
["37782","KAINDL 37782 Makassar",2800,2070,18,"IGEN",0,0,0,0,0,0,0,0,0,null,0,null,54650]
["40020","40020 Luc Tábla HT",2500,1000,18,"IGEN",0,0,0,0,0,0,0,0,0,null,0,null,40020]
["40300","40300 Borovi tábla HT A/A",2200,1200,18,"IGEN",0,0,0,0,0,0,0,0,0,null,0,null,40300]
["40310","40310 Borovi tábla HT A/A",2400,1200,18,"IGEN",0,0,0,0,0,0,0,0,0,null,0,null,40310]
["40311","40311 Borovi tábla HT A/A",2500,1200,18,"IGEN",0,0,0,0,0,0,0,0,0,null,0,null,40311]
["40312","40312 Borovi Tábla HT",2500,1200,18,"IGEN",0,0,0,0,0,0,0,0,0,null,0,null,40312]
["40315","40315 Borovi Tábla HT A/Akevert",3000,1200,18,"IGEN",0,0,0,0,0,0,0,0,0,null,0,null,40315]
["40318","40318 Borovi Tábla A/A",3000,1200,18,"IGEN",0,0,0,0,0,0,0,0,0,null,0,null,40318]
["40319","Borovi Fenyő HT 18x1200x3000",3000,1220,18,"IGEN",0,0,0,1000,10,1100,3660,1250,4575,null,0,null,281]
["40324","40324 Borovi Tábla HT.",3000,1200,24,"IGEN",0,0,0,0,0,0,0,0,0,null,0,null,40324]
["40327","40327 Borovi Tábla HT",2500,1200,24,"IGEN",0,0,0,0,0,0,0,0,0,null,0,null,40327]
["40330","40330 Borovi Tábla HT A/A",3000,1200,30,"IGEN",0,0,0,0,0,0,0,0,0,null,0,null,40330]
["40340","40340 Borovi Tábla HT A/A",3000,1200,40,"IGEN",0,0,0,0,0,0,0,0,0,null,0,null,40340]
["40341","40341 Borovi Tábla HT",2500,1200,40,"NEM",0,0,0,0,0,0,0,0,0,null,0,null,40341]
["40342","40342 Borovi Tábla HT",5100,1100,40,"IGEN",0,0,0,0,0,0,0,0,0,null,0,null,40342]
["40352","40352 Borovi Tábla HT A/A",2950,1200,18,"IGEN",0,0,0,0,0,0,0,0,0,null,0,null,40352]
["40365","40365 Borovi Tábla HT AB/AB Mix",3000,1200,18,"IGEN",0,0,0,0,0,0,0,0,0,null,0,null,40365]
["41018","41018 Luc Tábla TM B",3000,1220,18,"IGEN",0,0,0,0,0,0,0,0,0,null,0,null,41018]
["41021","41021 LUC TM",2500,1220,18,"IGEN",0,0,0,0,0,0,0,0,0,null,0,null,41021]
["41022","41022 LUC Táblásított",3000,1220,18,"IGEN",0,0,0,0,0,0,0,0,0,null,0,null,41022]
["41024","41024 Luc Tábla  B",3000,1220,24,"IGEN",0,0,0,0,0,0,0,0,0,null,0,null,41024]
["41316","41316 Borovi Tábla TM",2000,1200,18,"IGEN",0,0,0,0,0,0,0,0,0,null,0,null,41316]
["41318","41318 Borovi Tábla TM",2200,1200,18,"IGEN",0,0,0,0,0,0,0,0,0,null,0,null,41318]
["41319","41319 Borovi Tábla A/A TM",2400,1200,18,"IGEN",0,0,0,0,0,0,0,0,0,null,0,null,41319]
["41323","41323 Borovi Tábla",2200,1200,24,"IGEN",0,0,0,0,0,0,0,0,0,null,0,null,41323]
["41326","41326 Borovi Tábla TM",1900,1200,18,"IGEN",0,0,0,0,0,0,0,0,0,null,0,null,41326]
["41327","41327 Borovi Tábla TM",2100,1200,18,"IGEN",-2,0,0,0,0,0,0,0,0,null,0,null,41327]
["41332","41332 Borovi Tábla TM  A/A",2400,1200,32,"IGEN",0,0,0,0,0,0,0,0,0,null,0,null,41332]
["41333","41333 Borovi Tábla TM",3000,1200,24,"IGEN",0,0,0,0,0,0,0,0,0,null,0,null,41333]
["41334","41334 Boroví Tábla TM A/A",2500,1200,18,"IGEN",0,0,0,0,0,0,0,0,0,null,0,null,41334]
["41343","41343 Borovi TM",2500,1200,24,"IGEN",0,0,0,0,0,0,0,0,0,null,0,null,41343]
["41401","41401 Borovi Tábla",3000,1220,18,"IGEN",-4,0,0,0,0,0,0,0,0,null,0,null,41401]
["41402","41402 Boroví tábla",2500,1200,18,"IGEN",-13,0,0,0,0,0,0,0,0,null,0,null,41402]
["41406","41406 Borovi Tábla  TM",3600,1250,18,"IGEN",0,0,0,0,0,0,0,0,0,null,0,null,41406]
["41421","41421 Borovi Tábla TM B csomós",3000,1220,27,"IGEN",0,0,0,0,0,0,0,0,0,null,0,null,41421]
["41431","41431 Borovi Tábla  B/B",3000,1200,18,"IGEN",0,0,0,0,0,0,0,0,0,null,0,null,41431]
["41433","41433 Borovi Tábla TM Csómos",3000,1200,18,"IGEN",0,0,0,0,0,0,0,0,0,null,0,null,41433]
["41437","41437 Borovi Tábla",2500,1200,18,"IGEN",-1,0,0,0,0,0,0,0,0,null,0,null,41437]
["41439","41439 Borovi Tábla B",2500,1200,24,"IGEN",0,0,0,0,0,0,0,0,0,null,0,null,41439]
["41441","41441 Borovi Tábla B csomós",2500,1200,32,"IGEN",0,0,0,0,0,0,0,0,0,null,0]
["41443","41443 Borovi Tábla",2500,1200,18,"IGEN",0,0,0,0,0,0,0,0,0,null,0,null,41443]
["41503","41503 Borovi Tábla C/C kevert vágás",2400,1200,18,"IGEN",0,0,0,0,0,0,0,0,0,null,0,null,41503]
["41506","41506 Borovi Tábla TM C/C  csomós",3000,1200,20,"IGEN",0,0,0,0,0,0,0,0,0,null,0,null,41506]
["41602","41602 Gözölt Bükk TM A/B",2100,900,20,"IGEN",0,0,0,0,0,0,0,0,0,null,0,null,41602]
["41603","41603 Gőzölt Bükk TM A/B",1000,900,20,"IGEN",0,0,0,0,0,0,0,0,0,null,0,null,41603]
["41605","41605 Gözöltt Bükk Tábla",900,900,20,"IGEN",0,0,0,0,0,0,0,0,0,null,0,null,41605]
["41618","41623 Tölgy Tábla HT",900,920,30,"IGEN",0,0,0,0,0,0,0,0,0,null,0,null,41618]
["41620","Tölgy Tábla 41mm",2500,770,41,"IGEN",0,0,0,0,0,0,0,0,0,null,0]
["41623","41623 Tölgy tábla B/C",920,900,30,"IGEN",-3,0,0,0,0,0,0,0,0,null,0,null,41623]
["41634","41634 Bükk Tábla",2100,900,20,"IGEN",0,0,0,0,0,0,0,0,0,null,0,null,41634]
["41635","41635 Tölgy tábla",3000,1220,20,"IGEN",0,0,0,0,0,0,0,0,0,null,0,null,41605]
["42019","42019 Luc tábla 3R TM",5000,1250,19,"IGEN",-3,0,0,0,0,0,0,0,0,null,0,null,42019]
["50003","50003 Nyír rétegelt",1525,1525,3,"IGEN",0,0,0,0,0,0,0,0,0,null,0,null,50003]
["50004","5004 Nyír Rétegelt lemez",1520,1520,4,"IGEN",-1,0,0,0,0,0,0,0,0,null,0,null,50004]
["50005","50005 Nyír rétegelt lemez BB/CP",1525,1525,5,"IGEN",-4,0,0,0,0,0,0,0,0,null,0,null,50005]
["50006","50006 Nyír rétegelt lemez",1520,1520,6,"IGEN",0,0,0,0,0,0,0,0,0,null,0,null,50006]
["50010","50010 Nyír rétegelt 10mm",1525,1525,10,"IGEN",0,0,0,0,0,0,0,0,0,null,0]
["50012","50012 Nyír rétegelt lemez",1525,1525,12,"IGEN",0,0,0,0,0,0,0,0,0,null,0,null,50012]
["50015","50015 nyír rétegelt lemez",1525,1525,15,"IGEN",0,0,0,0,0,0,0,0,0,null,0,null,50015]
["50018","50018 Nyír rétegelt lemez BB/CP",1525,1525,18,"IGEN",0,0,0,0,0,0,0,0,0,null,0,null,50018]
["50021","50021 Nyír rétegelt lemez BB/CP",1525,1525,21,"IGEN",-1,0,0,0,0,0,0,0,0,null,0,null,50021]
["50038","50038 Nyír rétegelt 8×1525×1525 BB/BB",1525,1525,8,"IGEN",0,0,0,0,0,0,0,0,0,null,0]
["50040","50040 Nyír rétegeltl lemez BB/BB",1525,1525,10,"IGEN",0,0,0,0,0,0,0,0,0,null,0,null,50040]
["50042","50042 Nyír Rétegelt lemez BB/CP",1525,1525,12,"IGEN",0,0,0,0,0,0,0,0,0,null,0,null,50042]
["50045","50045 Nyír rétegelt lemez BB/CP",1525,1525,15,"IGEN",-14,0,0,0,0,0,0,0,0,null,0,null,50045]
["50048","50048 Nyír rétegelt lemez 18mm  BB/B",1525,1525,18,"IGEN",-1,0,0,0,0,0,0,0,0,null,0,null,50048]
["5008","5008 Nyír rétegelte lemez BB/CP",1525,1525,8,"IGEN",0,0,0,0,0,0,0,0,0,null,0,null,50008]
["50118","50118 Nyír Rétegelt BB/BB",1525,1525,18,"IGEN",0,0,0,0,0,0,0,0,0,null,0]
["50209","50209 Nyír rétegelt 9x1250x2500",2500,1250,9,"IGEN",0,0,0,0,0,0,0,0,0,null,0]
["50212","50212 Nyír rétegelet lemez BB/CP",2500,1250,12,"IGEN",-2,0,0,0,0,0,0,0,0,null,0,null,50218]
["50218","502018 Nyír rétegelt lemez  BB/CP",2500,1250,18,"NEM",0,0,0,0,0,0,0,0,0,null,0,null,50218]
["50275","50275 Nyír rétegelt lemez C/C",1250,2500,18,"IGEN",-1,0,0,0,0,0,0,0,0,null,0,null,50275]
["50285","50285 Nyír rétegelt lemez CP/C",2500,1250,18,"IGEN",-5,0,0,0,0,0,0,0,0,null,0,null,50285]
["50304","50304 Nyír rétegelt lemez BB/Cp",2500,1250,4,"NEM",0,0,0,0,0,0,0,0,0,null,0,null,50304]
["50306","50306 Nyír rétegelt lemez",2500,1250,6.5,"IGEN",0,0,0,0,0,0,0,0,0,null,0,null,50306]
["50309","50309 Nyír rétegelt lemez BB/CP",2500,1250,9,"IGEN",-1,0,0,0,0,0,0,0,0,null,0,null,50309]
["50312","50312 Nyír réegelt lemez BB/CP 1",2500,1250,12,"IGEN",-4,0,0,0,0,0,0,0,0,null,0,null,50312]
["50315","50315 Nyír rétegelte lemez BB/CP",2500,1250,15,"IGEN",-3,0,0,0,0,0,0,0,0,null,0,null,50315]
["50318","50318 Nyír rétegelt lemez BB/CP",2500,1250,18,"IGEN",-11,0,0,0,0,0,0,0,0,null,0,null,50318]
["50321","50321 Nyír rétegelt lemez BB/CP",2500,1250,21,"IGEN",-3,0,0,0,0,0,0,0,0,null,0,null,50321]
["50324","Nyír Rétegelt BB/CP",2500,1250,24,"IGEN",0,0,0,0,0,0,0,0,0,null,0]
["50327","50327 Nyír rétegelt BB/CP",2500,1250,27,"IGEN",0,0,0,0,0,0,0,0,0,null,0,null,50327]
["50330","50330 Nyír Rétegelt lemez",2500,1250,30,"IGEN",0,0,0,0,0,0,0,0,0,null,0,null,50330]
["50468","50468 Nyír Rétegelt S/BB",2500,1250,18,"IGEN",0,0,0,0,0,0,0,0,0,null,0,null,50468]
["50471","50471 Nyír Rétegelt lemez S/BB",2500,1250,21,"IGEN",0,0,0,0,0,0,0,0,0,null,0,null,50471]
["50507","50507 Nyír Rétegelt lemez BB/BB",3000,1500,4,"NEM",0,0,0,0,0,0,0,0,0,null,0,null,50507]
["51008","51008 Bükk Rétegelt lemez",2000,1250,8,"IGEN",0,0,0,0,0,0,0,0,0,null,0,null,51008]
["51212","51212 Luc rétegelt lemez  C",2500,1250,12,"IGEN",0,0,0,0,0,0,0,0,0,null,0,null,51212]
["51304","51304 Borovi Rétegelt lemez A/B",2500,1250,4,"IGEN",0,0,0,0,0,0,0,0,0,null,0,null,51304]
["51498","51498 Köris Rétegelt lemez",2500,1220,5,"IGEN",0,0,0,0,0,0,0,0,0,null,0,null,51498]
["51504","51504 Színfurenéros Fenyő lemez",2500,1250,4,"IGEN",0,0,0,0,0,0,0,0,0,null,0,null,51504]
["51505","51505 Színfurnéros Tölgy lemez A/BB",2500,1250,5,"IGEN",-5,0,0,0,0,0,0,0,0,null,0,null,51505]
["51506","51506 Színfurnéros Bükk lemez",2500,1250,4,"IGEN",0,0,0,0,0,0,0,0,0,null,0,null,51506]
["51521","51521 Bükk Rétegelt lemez",2500,1700,5,"IGEN",0,0,0,0,0,0,0,0,0,null,0,null,51521]
["52018","52018 Nyír rétegelt lemez F/F",2500,1250,18,"NEM",0,0,0,0,0,0,0,0,0,null,0,null,52018]
["52119","52119 Nyír rétegelt lemez F/F",2500,1250,9,"NEM",-1,0,0,0,0,0,0,0,0,null,0,null,52119]
["52206","52206 Nyír rétegelt lemez WM!F",2500,1250,6.5,"NEM",-1,0,0,0,0,0,0,0,0,null,0,null,52206]
["52209","52209 Nyír rétegelt lemez WM/F",2500,1250,9,"NEM",0,0,0,0,0,0,0,0,0,null,0,null,52209]
["52212","52212 Nyír rétegelt  lemez WM/F",2500,1250,12,"IGEN",0,0,0,0,0,0,0,0,0,null,0,null,52212]
["52215","52215 Nyír rétegelt lemez WM/F",2500,1250,15,"NEM",0,0,0,0,0,0,0,0,0,null,0,null,52215]
["52218","52218 Nyír rétegelt lemez WM/F",2500,1250,18,"IGEN",0,0,0,0,0,0,0,0,0,null,0,null,52218]
["52221","52221 Nyír rétegelt lemez WM/F",2500,1250,21,"NEM",0,0,0,0,0,0,0,0,0,null,0,null,52221]
["52309","52309 Nyír rétegelt lemez WM/F",2500,1500,9,"NEM",0,0,0,0,0,0,0,0,0,null,0,null,52309]
["52312","52312 Nyír rétegelt lemez WM/F",2500,1500,12,"NEM",0,0,0,0,0,0,0,0,0,null,0,null,52312]
["52315","52315 Nyír rétegelt lemez WM/F",2500,1500,15,"NEM",0,0,0,0,0,0,0,0,0,null,0,null,52315]
["52318","52318 Nyír rétegelt lemez WM/F",2500,1500,18,"NEM",-2,0,0,0,0,0,0,0,0,null,0,null,52318]
["52321","52321 Nyír rétegelt lemezWM/F",2500,1500,21,"NEM",-18,0,0,0,0,0,0,0,0,null,0,null,52321]
["53842","53842 Kronoswiss  Erezett fehér",2800,2070,18,"IGEN",-43,0,0,0,0,0,0,0,0,null,0,null,53842]
["53843","Korpusz fehér",2750,1830,18,"NEM",0,0,0,0,0,0,0,0,0,null,0]
["540100KASTA","540100 Pet Magasfényű fehér",2800,1220,19,"NEM",-124,0,0,0,0,0,0,0,0,null,0,null,540100]
["54596","SKIN Forgácslap Frassino Dali",2800,2070,18,"IGEN",0,0,0,0,0,0,0,0,0,null,0,null,54596]
["546010","546010 Pet Magasfényű Fehér",2800,1220,19,"NEM",-31,0,0,0,0,0,0,0,0,null,0,null,546010]
["546015","546015 Pet Magasfényű Bézs",2800,1220,19,"NEM",-5,0,0,0,0,0,0,0,0,null,0,null,546015]
["546020","546020 Pet Magasfényű Krém",2800,1220,18,"NEM",-10,0,0,0,0,0,0,0,0,null,0,null,546020]
["546025","546025 Pet Capuccino",2800,1220,18,"NEM",-4,0,0,0,0,0,0,0,0,null,0,null,546025]
["546027","546027 Pet  Magasfényű Mink",2800,1220,18,"NEM",0,0,0,0,0,0,0,0,0,null,0,null,246027]
["546030","546030 Pet Magasfényű Piros",2800,1220,18,"NEM",0,0,0,0,0,0,0,0,0,null,0,null,546030]
["546035","546035 Pet Magasfényű Szürke",2800,1220,19,"NEM",-6,0,0,0,0,0,0,0,0,null,0,null,546035]
["546040","546040 Pet Magasfenyű fekete",2800,1220,19,"NEM",-14,0,0,0,0,0,0,0,0,null,0,null,546040]
["546045","546045 Pet Magasfényű  Antracit",2800,1220,18,"NEM",-1,0,0,0,0,0,0,0,0,null,0,null,546045]
["546060","546060 Pet Magasfényű zöld",2800,1220,18,"NEM",0,0,0,0,0,0,0,0,0,null,0,null,546060]
["546070","546070 Pet Magasfényű Lila",2800,1220,18,"NEM",0,0,0,0,0,0,0,0,0,null,0,null,546070]
["546080","GIZIR 6080 Bordó",2800,1220,18,"NEM",0,0,0,0,0,0,0,0,0,null,0]
["546090","546090 Pet Magasfenyű Sötét barna",2800,1220,18,"IGEN",0,0,0,0,0,0,0,0,0,null,0,null,546090]
["546100","546100 Pet Magasfényű  Zebranó",2800,1220,18,"IGEN",0,0,0,0,0,0,0,0,0,null,0,null,546100]
["546103","546103  Pet MagasfényűOregon Walnut",2800,1220,18,"IGEN",-19,0,0,0,0,0,0,0,0,null,0,null,546103]
["546105","546105 Pet Magasfényű Terra Kávé",2800,1220,18,"IGEN",-2,0,0,0,0,0,0,0,0,null,0,null,546105]
["546106","6106 Pet Magasfényű Terra Silver",2800,1220,18,"IGEN",0,0,0,0,0,0,0,0,0,null,0,null,546106]
["546107","546107 Pet Magasfényű  Fehér Dér",2800,1220,18,"IGEN",0,0,0,0,0,0,0,0,0,null,0,null,546107]
["546108","GIZIR 6108 Fekete Dér",2800,1220,18,"NEM",0,0,0,0,0,0,0,0,0,null,0]
["546109","546109 Pet Magasfényű  Terra latte",2800,1220,18,"IGEN",0,0,0,0,0,0,0,0,0,null,0,null,546109]
["546112","546112 Pet Magasfényű Japán Cherry",2800,1220,18,"IGEN",-3,0,0,0,0,0,0,0,0,null,0,null,546112]
["546113","546113 Pet Magasfényű Cedar",2800,1220,18,"IGEN",0,0,0,0,0,0,0,0,0,null,0,null,546113]
["546114","546114 Pet Magasfényű Oak Cankut",2800,1220,18,"IGEN",-3,0,0,0,0,0,0,0,0,null,0,null,546114]
["546115","546115 Pet Magasfényű Akác",2800,1220,18,"IGEN",0,0,0,0,0,0,0,0,0,null,0,null,546115]
["546116","546116 Pet Magasfényű  Akác",2800,1220,18,"IGEN",0,0,0,0,0,0,0,0,0,null,0,null,546116]
["546125","546125 Pet Magasfényű Német Tölgy",2800,1220,18,"IGEN",-3,0,0,0,0,0,0,0,0,null,0,null,516125]
["546130","546130 Pet magasfényű Sötét oliva",2800,1220,18,"IGEN",0,0,0,0,0,0,0,0,0,null,0,null,546130]
["546135","546135 Pet Magasfényű Mogyoró",2800,1220,19,"IGEN",0,0,0,0,0,0,0,0,0,null,0,null,546135]
["546151","546151Pet Magasfényűú Fehér Csíkos",2800,1220,18,"IGEN",-1,0,0,0,0,0,0,0,0,null,0,null,516151]
["546158","546158 Pet Magasfenyű Fehér gyöngy",2800,1220,18,"IGEN",0,0,0,0,0,0,0,0,0,null,0,null,546158]
["546162","546162 Pet Magasfényű Galaxy fehér",2800,1220,18,"IGEN",0,0,0,0,0,0,0,0,0,null,0,null,546162]
["546169","GIZIR 6169 Fehér Parabola",2800,1220,18,"IGEN",0,0,0,0,0,0,0,0,0,null,0]
["546170","546170 Pet Magasfényű ALU",2800,1220,18,"IGEN",0,0,0,0,0,0,0,0,0,null,0,null,546170]
["546172","546172 Pet Magasfényű Cream Sparkle",2800,1220,18,"NEM",-4,0,0,0,0,0,0,0,0,null,0,null,546172]
["546177","546177 Pet Magasfényű Fehér arany",2800,1220,18,"IGEN",-3,0,0,0,0,0,0,0,0,null,0,null,546177]
["546180","546180 Pet Magasfényű Szürke virág",2800,1220,18,"IGEN",0,0,0,0,0,0,0,0,0,null,0,null,546180]
["546181","546181 Pet Magasfényű White Leaf",2800,1220,18,"IGEN",-9,0,0,0,0,0,0,0,0,null,0,null,546181]
["546182","546182 Pet Magasfényű6182 white sparkle",2800,1220,18,"IGEN",-1,0,0,0,0,0,0,0,0,null,0,null,546182]
["546183","546183 Pet Magasfényű Black Leaf",2800,1220,18,"IGEN",-2,0,0,0,0,0,0,0,0,null,0,null,546183]
["546185","546185 Pet Magasfényű Cappucino gyöngy",2800,1220,18,"IGEN",0,0,0,0,0,0,0,0,0,null,0,null,516185]
["546186","546186  Pet Magasfényű  Len  Beige",2800,1220,18,"IGEN",-5,0,0,0,0,0,0,0,0,null,0,null,546186]
["546187","546187 Pet Magasfényű Terra",2800,1220,18,"IGEN",0,0,0,0,0,0,0,0,0,null,0,null,546187]
["546189","6189 Pet MagasfényűSzikrázó Méz",2800,1220,18,"NEM",0,0,0,0,0,0,0,0,0,null,0,null,546189]
["546190","546190 Pet Magasfényű  White Spike",2800,1220,18,"IGEN",0,0,0,0,0,0,0,0,0,null,0,null,546190]
["546193","546193 Pet MagasfényűArany Háló",2800,1220,18,"IGEN",0,0,0,0,0,0,0,0,0,null,0,null,546193]
["546195","546195 Pet Magasfényű Kenya Silver",2800,1220,18,"IGEN",0,0,0,0,0,0,0,0,0,null,0,null,546195]
["546196","546196 Pet Magasfényű Crokodil",2800,1220,18,"NEM",-3,0,0,0,0,0,0,0,0,null,0,null,546196]
["546198","546198 Pet Magasfényű Linen Grey",2800,1220,18,"IGEN",0,0,0,0,0,0,0,0,0,null,0,null,546198]
["546200","546200 Pet Magasfrényű Világos Szövet",2800,1220,18,"IGEN",0,0,0,0,0,0,0,0,0,null,0,null,546200]
["546220","546220 Pet Magasfényű Cream Sparkle",2800,1220,18,"NEM",0,0,0,0,0,0,0,0,0,null,0,null,546220]
["546282","546282 Pet Magasfényű  Fehér Szikla",2800,1220,18,"NEM",0,0,0,0,0,0,0,0,0,null,0,null,546282]
["546290","GIZIR 6290 Szikrázó Barna",2800,1220,18,"NEM",0,0,0,0,0,0,0,0,0,null,0]
["546300","546300 Pet Magasfényű Sahara fehér",2800,1220,18,"IGEN",0,0,0,0,0,0,0,0,0,null,0,null,546300]
["546410","546410 Pet Magasfényű Metál fehér",2800,1220,18,"NEM",-5,0,0,0,0,0,0,0,0,null,0,null,546410]
["546420","546420 Pet Magasfényű Vanilia",2800,1220,18,"NEM",-1,0,0,0,0,0,0,0,0,null,0,null,546420]
["546435","546435 Pet Magasfényű Metál Szürke",2800,1220,18,"NEM",0,0,0,0,0,0,0,0,0,null,0,null,546135]
["546495","546495 Pet Mafasfényű Bordó",2800,1220,18,"NEM",0,0,0,0,0,0,0,0,0,null,0,null,546495]
["54700","54700 Forgácslap Fehér",2750,1830,10,"NEM",-60,0,0,0,0,0,0,0,0,null,0,null,54700]
["54701","54701 Forgácslap Prémium fehér",2750,1830,18,"NEM",0,0,0,0,0,0,0,0,0,null,0,null,54701]
["54702","54702 Forgácslap Korpuszfehér",2750,1825,18,"NEM",-8,0,0,0,0,0,0,0,0,null,0,null,54702]
["54703","54703 Forgácslap Elit Fehér",2750,1825,18,"NEM",-1577,0,0,1720,10,1892,8632,2150,10790,null,0,null,54703]
["54703 PR","54703 PR Forgácslap PR-I Erezett fehér",2750,1825,18,"IGEN",-1,0,0,0,0,0,0,0,0,null,0,null,"54703 PR"]
["54703/36","54703/36 Forgácslap Elit Fehér",2750,1830,36,"NEM",0,0,0,0,0,0,0,0,0,null,0]
["54703PE","54703PE Forgácsalp Prégelt fehér",2750,1830,18,"NEM",-107,0,0,0,0,0,0,0,0,null,0,null,"54703 PE"]
["54704","54704 Forgácslap Bavária bükk világos SE",2750,1830,18,"IGEN",-161,0,0,0,0,0,0,0,0,null,0,null,54704]
["54704/26","54704/26 Forgácslap Bavaria bükk világos",2750,1830,26,"IGEN",0,0,0,0,0,0,0,0,0,null,0]
["54704/36","54704 Forgácslap Bavária bükk világos SE",2750,1830,36,"IGEN",0,0,0,0,0,0,0,0,0,null,0]
["54705","54705 Forgácslap Bavaria bükk sötét SE",2750,1830,18,"IGEN",-14,0,0,0,0,0,0,0,0,null,0,null,54705]
["54706","54706 Forgácslap Vanilia PE",2750,1830,18,"NEM",-58,0,0,0,0,0,0,0,0,null,0,null,54706]
["54707","54707 Forgácslap Oxford cseresznye SE",2750,1830,18,"IGEN",-205,0,0,0,0,0,0,0,0,null,0,null,54707]
["54708","54708 Fogácslap Hegyi Éger SE",2750,1830,18,"IGEN",-100,0,0,0,0,0,0,0,0,null,0,null,54708]
["547081","GIZIR 7081 Bézs Bőr",2800,1220,18,"NEM",0,0,0,0,0,0,0,0,0,null,0]
["547087","GIZIR 7087 Stratum Inox",2800,1220,18,"IGEN",0,0,0,0,0,0,0,0,0,null,0,null,547087]
["54710","54710 Forgácslap Dió Ekko SE",2750,1830,18,"IGEN",-86,0,0,0,0,0,0,0,0,null,0,null,54710]
["54711","54711 Forgácslap Olasz Díó",2750,1830,18,"IGEN",-7,0,0,0,0,0,0,0,0,null,0,null,54711]
["54712","54712 Forgácslap Mogyoró",2750,1830,18,"IGEN",-1,0,0,0,0,0,0,0,0,null,0,null,54712]
["54713","54713 Forgácslap Lugano Tölgy",2750,1830,18,"IGEN",0,0,0,0,0,0,0,0,0,null,0,null,54713]
["54717","54717 Forgácslap Tölgy tiszta",2750,1830,18,"IGEN",-10,0,0,0,0,0,0,0,0,null,0,null,54717]
["54718","54718 Forgácslap Calvados SE",2750,1830,18,"IGEN",-125,0,0,0,0,0,0,0,0,null,0,null,54718]
["54719","54719 Forgácslap Krém",2750,1830,18,"NEM",-15,0,0,0,0,0,0,0,0,null,0,null,54719]
["54720","54720 Forgácslap Mahagóni SE",2750,1830,18,"IGEN",-71,0,0,0,0,0,0,0,0,null,0,null,54720]
["54721","54721 Forgácslap Szürke PE-II",2750,1830,18,"NEM",-87,0,0,0,0,0,0,0,0,null,0,null,54721]
["54721/36","54721/36 Forgácslap Szürke",2750,1830,36,"NEM",0,0,0,0,0,0,0,0,0,null,0]
["54722","54722 Forgácslap Cseresznye SE",2750,1830,18,"IGEN",0,0,0,0,0,0,0,0,0,null,0,null,54722]
["54723","54723 Forgácslap Locarno alma sötét",2750,1830,18,"IGEN",0,0,0,0,0,0,0,0,0,null,0,null,54723]
["54727","54727 Forgácslap Lion Dio SE II",2750,1830,18,"IGEN",-17,0,0,0,0,0,0,0,0,null,0,null,54727]
["54728","54728 Forgácslap Svájci Dió SE",2750,1830,18,"IGEN",-28,0,0,0,0,0,0,0,0,null,0,null,54728]
["54729","54729 Forgácslap  Alpesi tölgy SE II",2750,1830,18,"IGEN",-133,0,0,0,0,0,0,0,0,null,0,null,54729]
["54729/36","54729/36 Forgácslap Alpesi tölgy SEII",2750,1830,36,"IGEN",0,0,0,0,0,0,0,0,0,null,0]
["54734","54734 Forgácslap Tanzau juhar SE",2750,1830,18,"IGEN",-185,0,0,0,0,0,0,0,0,null,0,null,54734]
["54740","54740 Forgácslap Wenge SE",2750,1830,18,"IGEN",-79,0,0,0,0,0,0,0,0,null,0,null,54740]
["54740/36","54740 Forgácslap Wenge",2750,1830,36,"IGEN",0,0,0,0,0,0,0,0,0,null,0]
["54745","54745 Forgácslap Prégelt fekete",2750,1830,18,"NEM",-53,0,0,0,0,0,0,0,0,null,0,null,54745]
["54745/36","54745/36 Forgácslap Prégelt fekete",2750,1830,36,"IGEN",0,0,0,0,0,0,0,0,0,null,0]
["54746","54746 Forgácslap Grenadai Kőris",2750,1830,18,"IGEN",0,0,0,0,0,0,0,0,0,null,0,null,54746]
["54751"," 54751 Világos Hegyi Éger",2750,1830,18,"IGEN",0,0,0,0,0,0,0,0,0,null,0]
["54756","54756 Forgácslap Wallis Szilva SE-II",2750,1830,18,"IGEN",-95,0,0,0,0,0,0,0,0,null,0,null,54756]
["54757","54757 Forgácslap Borovi fenyő SE",2750,1830,18,"IGEN",-76,0,0,0,0,0,0,0,0,null,0,null,54757]
["54762","54762 Forgácslap Californiai Dió",2750,1830,18,"IGEN",-3,0,0,0,0,0,0,0,0,null,0,null,54762]
["54763","54763 Forgácslap Klasszikus Dió",2750,1830,18,"IGEN",0,0,0,0,0,0,0,0,0,null,0,null,54763]
["54768","54768 Forgácslap Antik Tölgy",2750,1830,18,"IGEN",-4,0,0,0,0,0,0,0,0,null,0,null,54768]
["54780","54780 Forgácslap Koimbra Köris",2750,1830,18,"IGEN",-212,0,0,0,0,0,0,0,0,null,0,null,54780]
["54780/36","54780 Forgácslap Koimbra kőris",2750,1830,36,"IGEN",0,0,0,0,0,0,0,0,0,null,0]
["54781","54781 Forácslap Akác SE",2750,1830,18,"IGEN",-41,0,0,0,0,0,0,0,0,null,0,null,54781]
["54788","54788 Forgácslap Világos Vadkörte SE",2750,1830,18,"IGEN",-14,0,0,0,0,0,0,0,0,null,0,null,54788]
["54789","54789 Forgácslap Sötét vadkörte SE",2750,1830,18,"IGEN",-18,0,0,0,0,0,0,0,0,null,0,null,54789]
["54794","54794 Forgácslap Indián Fa WL",2750,1830,18,"IGEN",-24,0,0,0,0,0,0,0,0,null,0,null,54794]
["54812","54812 Forgácslap Narancs PE (0242)",2750,1830,18,"NEM",-9,0,0,0,0,0,0,0,0,null,0,null,54812]
["54817","54817 Forgácslap Sárga PE (0070)",2750,1830,18,"NEM",0,0,0,0,0,0,0,0,0,null,0,null,54817]
["54818","54818  Forgácslap Zöld víz PE",2750,1830,18,"NEM",-3,0,0,0,0,0,0,0,0,null,0,null,54818]
["54828","54828 Forgácslap Sötétkék",2750,1830,18,"NEM",0,0,0,0,0,0,0,0,0,null,0,null,54828]
["54835","54835 Forgácslap  fehér SM-I",2750,1830,16,"NEM",-197,0,0,0,0,0,0,0,0,null,0,null,54835]
["54900","54900 Forgácslap Anszbergi Sötét Tölgy",2750,1830,18,"IGEN",-126,0,0,0,0,0,0,0,0,null,0,null,54900]
["54901","54901 Forgácslap Anszbergi Világos Tölgy",2750,1830,18,"IGEN",-49,0,0,0,0,0,0,0,0,null,0,null,54901]
["54903","54903 Forgácslap Niagara Kőris natúr",2750,1830,18,"IGEN",-34,0,0,0,0,0,0,0,0,null,0,null,54903]
["54905","54905 Forgácslap Lakeland vil Akác SG",2750,1830,18,"IGEN",-9,0,0,0,0,0,0,0,0,null,0,null,54905]
["54906","54906 Forgácslap Hegyi Tölgy",2750,1830,18,"IGEN",0,0,0,0,0,0,0,0,0,null,0,null,54906]
["54908","54908 Forgácslap Libanoni tölgy",2750,1830,18,"IGEN",-222,0,0,0,0,0,0,0,0,null,0,null,54908]
["54908/36","54908 Forgácslap Libanoni tölgy",2750,1830,36,"IGEN",-1,0,0,0,0,0,0,0,0,null,0]
["54912","54912 Forgácslap Chester Tölgy WL",2750,1830,18,"IGEN",-1,0,0,0,0,0,0,0,0,null,0,null,54912]
["54915","54915 Forgácslap Sötét sonoma tölgy WL",2750,1830,18,"IGEN",-81,0,0,0,0,0,0,0,0,null,0,null,54915]
["54916","54916 Forgácslap Cabo Verde",2750,1830,18,"IGEN",-57,0,0,0,0,0,0,0,0,null,0,null,54916]
["54919","54919 Forgácslap Brioti",2750,1830,18,"IGEN",-153,0,0,0,0,0,0,0,0,null,0,null,54919]
["54919/36","54919 Forgácslap Brioti",2750,1830,36,"IGEN",0,0,0,0,0,0,0,0,0,null,0]
["54920","54920 Forgácslap Arkansas tölgy",2750,1830,18,"IGEN",-62,0,0,0,0,0,0,0,0,null,0,null,54920]
["54921","54921 Forgácslap Arkansas Sötét tölgy",2750,1830,18,"IGEN",-4,0,0,0,0,0,0,0,0,null,0,null,54921]
["54922","54922 Forgácslap Madagaskar",2750,1830,18,"IGEN",-10,0,0,0,0,0,0,0,0,null,0,null,54922]
["54928","54928 Forgácslap Grenoble Tölgy WL",2750,1830,18,"IGEN",-34,0,0,0,0,0,0,0,0,null,0,null,54928]
["54933","54933 Forgácslap Lombardiai Dió világos",2750,1830,18,"IGEN",0,0,0,0,0,0,0,0,0,null,0,null,54933]
["54934","54934 Forgácslap Lombardo dió sötét",2750,1830,18,"IGEN",0,0,0,0,0,0,0,0,0,null,0,null,54934]
["54944","54944 Forgácslap Hacienda Világos",2750,1830,18,"IGEN",-21,0,0,0,0,0,0,0,0,null,0,null,54944]
["54952","54952 Forgácslap Trüffel Sanoma",2750,1830,18,"IGEN",-119,0,0,0,0,0,0,0,0,null,0,null,54952]
["549540","549540 Pet karcálló fekete",2800,1220,18,"NEM",0,0,0,0,0,0,0,0,0,null,0,null,549540]
["54962","54962 Forgácslap Élénk Zöld PE (0413)",2750,1830,18,"NEM",0,0,0,0,0,0,0,0,0,null,0,null,54962]
["54964","54964 Forgácslap Málna PE (0415)",2750,1830,18,"NEM",0,0,0,0,0,0,0,0,0,null,0,null,54964]
["54975","54975 Forgácslap Kőris",2750,1830,18,"IGEN",0,0,0,0,0,0,0,0,0,null,0,null,54975]
["54978","54978 Forgácslap Hajó tölgy WL",2750,1830,18,"IGEN",-56,0,0,0,0,0,0,0,0,null,0,null,54978]
["54980","54980 Forgácslap Tahoe Tölgy WL",2750,1830,18,"IGEN",-137,0,0,0,0,0,0,0,0,null,0,null,54980]
["5499001","5499001 Forgácslap Sherwood Tölgy",2750,1830,18,"IGEN",-275,0,0,0,0,0,0,0,0,null,0,null,5499001]
["5499003","5499003 Forgácslap Klondikie Tölgy",2750,1830,18,"IGEN",-19,0,0,0,0,0,0,0,0,null,0,null,5499003]
["5499006","5499006 Forgácslap Country",2750,1830,18,"IGEN",-84,0,0,0,0,0,0,0,0,null,0,null,5499006]
["5499009","5499009 Forgácslap WL Sötét Rigolettó",2750,1830,18,"IGEN",-1,0,0,0,0,0,0,0,0,null,0,null,5499009]
["5499010","5499010 Forgácslap Alaszka",2750,1830,18,"IGEN",-15,0,0,0,0,0,0,0,0,null,0,null,5499010]
["5499011","5499011 Forgácslap Monolit",2750,1830,18,"IGEN",-4,0,0,0,0,0,0,0,0,null,0,null,5499011]
["5499012","5499012 Forgácslap Alkímia SG",2750,1830,18,"IGEN",-23,0,0,0,0,0,0,0,0,null,0,null,5499012]
["5499014","5499014 Forgácslap Tejeskávé SG",2750,1830,18,"NEM",-49,0,0,0,0,0,0,0,0,null,0,null,5499014]
["5499015","5499015 Forgácsla Szimfónia WL",2750,1830,18,"IGEN",-37,0,0,0,0,0,0,0,0,null,0,null,5499015]
["5499019","5499019 Forgácslap Verónai Mogyoró WL",2750,1830,18,"IGEN",-19,0,0,0,0,0,0,0,0,null,0,null,5499019]
["5499020","5499020 Forgácslap Cimkés Country",2750,1830,18,"IGEN",0,0,0,0,0,0,0,0,0,null,0,null,5499020]
["5499021","5499021 Forgácslap Címkés Hajó Tölgy",2750,1830,18,"IGEN",-26,0,0,0,0,0,0,0,0,null,0,null,5499021]
["5499022","5499022 Forgácslap Sandináv Bükk SE",2750,1830,18,"IGEN",-11,0,0,0,0,0,0,0,0,null,0,null,5499022]
["5499023","5499023 Forgácslap Shimo Hamu világos",2750,1830,18,"IGEN",-6,0,0,0,0,0,0,0,0,null,0,null,5499023]
["5499026","5499026 Forgácslap Mangrove",2750,1830,18,"IGEN",-130,0,0,0,0,0,0,0,0,null,0,null,5499026]
["5499027","5499027 Forgácslap Vasco Da Gama",2750,1830,18,"IGEN",-23,0,0,0,0,0,0,0,0,null,0,null,5499027]
["5499030","5499030 Forgácslap Szürke",2750,1830,16,"NEM",-7,0,0,0,0,0,0,0,0,null,0,null,5499030]
["5499031","5499031 Forgácslap Mikado Bronz",2750,1830,18,"IGEN",-11,0,0,0,0,0,0,0,0,null,0,null,5499031]
["5499032","5499032 Forgácslap Barna Country WL",2750,1830,18,"IGEN",-18,0,0,0,0,0,0,0,0,null,0,null,5499032]
["5499033","5499033 Forgácslap Heartwood WL",2750,1830,18,"IGEN",-4,0,0,0,0,0,0,0,0,null,0,null,5499033]
["5499034","5499034 Forgácslap Fjordland WL",2750,1830,18,"IGEN",-8,0,0,0,0,0,0,0,0,null,0,null,5499034]
["5499035","5499035 Forgácslap Antracit SG",2750,1830,18,"NEM",-53,0,0,0,0,0,0,0,0,null,0,null,5499035]
["5499036","5499036 Ceylon Vanillia",2750,1830,18,"NEM",-26,0,0,0,0,0,0,0,0,null,0,null,5499036]
["5499037","5499037 Forgácslap Dió Olasz",2750,1830,18,"IGEN",0,0,0,0,0,0,0,0,0,null,0,null,5499037]
["54992","54992 Forgácslap Sanoma tölgy SE",2750,1830,18,"IGEN",-392,0,0,0,0,0,0,0,0,null,0,null,54992]
["54992/26","54992/26 Forgácslap Sonoma tölgy",2750,1830,26,"IGEN",-1,0,0,0,0,0,0,0,0,null,0]
["54992/36","54992 Forgácslap Sonoma tölgy",2750,1830,36,"IGEN",0,0,0,0,0,0,0,0,0,null,0]
["54993","54993 Forgács Calvados  PE",2750,1830,18,"IGEN",0,0,0,0,0,0,0,0,0,null,0,null,54993]
["54995","54995 Forgácslap Vasco Da Gamma WL",2750,1830,18,"IGEN",0,0,0,0,0,0,0,0,0,null,0,null,54995]
["54A025","54A025 Akril Cappuccino",2800,1220,19,"NEM",0,0,0,0,0,0,0,0,0,null,0,null,"54A025"]
["54S010","54S010 Pet S010 Matt Fehér",2800,1220,18,"NEM",-3,0,0,0,0,0,0,0,0,null,0,null,"54S010"]
["54S036","54S036 Pet S036 Matt Szürke",2800,1220,18,"NEM",0,0,0,0,0,0,0,0,0,null,0]
["54S040","GIZIR S040 Matt Fekete",2800,1220,18,"NEM",0,0,0,0,0,0,0,0,0,null,0]
["55002","55002 Forgácslap Natur 16mm",2820,2070,16,"NEM",0,0,0,0,0,0,0,0,0,null,0,null,55002]
["55010","55010 Forgácslap  Natúr 10mm",2440,1830,10,"NEM",-9,0,0,0,0,0,0,0,0,null,0,null,55010]
["55011","55011 Forgácslap  Natúr 10mm",2800,2070,10,"NEM",0,0,0,0,0,0,0,0,0,null,0,null,55011]
["55018","55018 Forgácslap Natúr 18mm",2800,2070,18,"NEM",0,0,0,0,0,0,0,0,0,null,0,null,55018]
["55110","55110 Forgácslap Natúr 10mm",2750,1830,10,"NEM",-2,0,0,0,0,0,0,0,0,null,0,null,55110]
["55116","55116 Forgácslap Natúr 16mm",2750,1830,16,"NEM",-1,0,0,0,0,0,0,0,0,null,0,null,55116]
["55118","55118 Forgácslap Natur 18mm",2750,1830,18,"NEM",-24,0,0,0,0,0,0,0,0,null,0,null,55118]
["55510","55510 Furnérozott Borovi 19mm A/B",2800,2070,19,"IGEN",-6,0,0,0,0,0,0,0,0,null,0,null,55510]
["55520","55520 Furnérozott Bükk 19mm A/B",2800,2070,19,"IGEN",-2,0,0,0,0,0,0,0,0,null,0,null,55520]
["55530","55530 Furnérozott Tölgy 19mm A/B",2800,2070,19,"IGEN",-27,0,0,0,0,0,0,0,0,null,0,null,55530]
["55532","55532 Furnérozott Kőris 19mm",2800,2070,18,"IGEN",-4,0,0,0,0,0,0,0,0,null,0,null,55532]
["55534","55534 Furnérozott Dió 19mm",2800,2070,18,"IGEN",0,0,0,0,0,0,0,0,0,null,0,null,55534]
["55535","55535 Furnérozott Juhar 19mm A/B",2800,2070,19,"IGEN",-3,0,0,0,0,0,0,0,0,null,0,null,55535]
["55536","55536 Furnérozott Cseresznye 19mm",2800,2070,19,"IGEN",0,0,0,0,0,0,0,0,0,null,0,null,55536]
["55540","55540 Shinnoky Yvori Oak",2790,1240,19,"IGEN",0,0,0,0,0,0,0,0,0,null,0,null,55540]
["57004","57004  MDF Natur 4mm",2800,2070,4,"NEM",-10,0,0,0,0,0,0,0,0,null,0,null,57004]
["57005","57005 MDF Natur 5mm",2800,2070,5,"NEM",0,0,0,0,0,0,0,0,0,null,0,null,57005]
["57006","57006  MDF Natur 6mm",2800,2070,6,"NEM",-4,0,0,0,0,0,0,0,0,null,0,null,57006]
["57008","57008 MDF Natur 8mm",2800,2070,8,"NEM",0,0,0,0,0,0,0,0,0,null,0,null,57008]
["57010","57010 MDF Natur 10mm",2800,2070,10,"NEM",-15,0,0,0,0,0,0,0,0,null,0,null,57010]
["57012","57012 MDF Natur 12mm",2800,2070,12,"NEM",-19,0,0,0,0,0,0,0,0,null,0,null,57012]
["57016","57016 MDF Natur 16mm",2800,2070,16,"NEM",-11,0,0,0,0,0,0,0,0,null,0,null,57016]
["57018","57018 MDF Natur 18mm",2800,2070,18,"NEM",-83,0,0,0,0,0,0,0,0,null,0,null,57018]
["57019","57019 MDF Natur 19mm",2800,2070,19,"NEM",-3,0,0,0,0,0,0,0,0,null,0,null,57019]
["57021","57021 MDF Mélyen marható",2620,2070,18,"NEM",0,0,0,0,0,0,0,0,0,null,0,null,57021]
["57022","57022 MDF Natur 22mm",2800,2070,22,"NEM",0,0,0,0,0,0,0,0,0,null,0,null,57022]
["57023","57023 MDF Mélyen marható",2620,2070,16,"NEM",-1,0,0,0,0,0,0,0,0,null,0,null,57023]
["57025","5025 MDF Natur 25mm",2800,2070,25,"NEM",-3,0,0,0,0,0,0,0,0,null,0,null,57025]
["57040","57040 MDF Natur 40mm",2800,2070,40,"NEM",-6,0,0,0,0,0,0,0,0,null,0,null,57040]
["57116","57116 MDF laminált 16mm",2800,2070,16,"NEM",-2,0,0,0,0,0,0,0,0,null,0,null,57116]
["57117","57117 MDF laminált fehér",2620,2070,18,"NEM",0,0,0,0,0,0,0,0,0,null,0,null,57117]
["57118","57118 MDF Egyold. laminált fehér",2800,2070,18,"NEM",-4,0,0,0,0,0,0,0,0,null,0,null,57118]
["57318","57318 MDF Vízálló",3050,1220,18,"NEM",0,0,0,0,0,0,0,0,0,null,0,null,57318]
["58032","58032 HDF 3mm Natúr",2745,1700,3,"NEM",0,0,0,0,0,0,0,0,0,null,0,null,58032]
["58033","Farostlemez",2745,1700,3.2,"NEM",0,0,0,0,0,0,0,0,0,null,0,null,0]
["58510","58510 OSB Standard 10mm",2500,1250,10,"NEM",0,0,0,0,0,0,0,0,0,null,0,null,58510]
["58512","58512 OSB12",2500,1250,12,"NEM",0,0,0,0,0,0,0,0,0,null,0]
["58515","58515 OSB 15mm",2500,1250,15,"NEM",0,0,0,0,0,0,0,0,0,null,0,null,58515]
["58518","58518 OSB Sandard 18mm",2500,1250,18,"NEM",0,0,0,0,0,0,0,0,0,null,0,null,58518]
["58522","58522 OSB",2500,1250,22,"NEM",0,0,0,0,0,0,0,0,0,null,0,null,58522]
["8547 SN","Kronowwod 8547 SN",2800,2070,18,"IGEN",0,0,0,0,0,0,0,0,0,null,0]
["A 423 PS13","KASTAMONU A 423 San Remo",2800,2070,18,"IGEN",0,0,0,0,0,0,0,0,0,null,0,null,54379]
["A 429 PS13","KASTAMONU A429 ETNA",2800,2070,18,"IGEN",0,0,0,0,0,0,0,0,0,null,0,null,54398]
["A 842 PS19","KASTAMONU A842 PS19 Világos t",2800,2070,18,"IGEN",0,0,0,0,0,0,0,0,0,null,0,null,54399]
["A316 PS11","KASTAMONU A316 Nairobi Wenge",2800,2070,18,"IGEN",0,0,0,0,0,0,0,0,0,null,0,null,54317]
["A319 PS17","KASTAMONU A319 Juhar",2800,2070,18,"IGEN",-1,0,0,0,0,0,0,0,0,null,0,null,54203]
["A351 PS 11","KASTAMONU A351 PS11  Sötét Alma",2800,2070,18,"IGEN",0,0,0,0,0,0,0,0,0,null,0,null,54223]
["A353 PS17","KASTAMONU A353PS17",2800,2070,18,"IGEN",0,0,0,0,0,0,0,0,0,null,0,null,54239]
["A354 PS19","KASTAMONU A354 PS19  Bosfor",2800,2070,18,"IGEN",0,0,0,0,0,0,0,0,0,null,0,null,54257]
["A356 ST11","KASTAMONU A 356 ST11 Classic Zebrano",2800,2070,18,"IGEN",-5,0,0,0,0,0,0,0,0,null,0,null,54232]
["A357 PS19","KASTAMONU A357 PS19 Spruce",2800,2070,18,"IGEN",-1,0,0,0,0,0,0,0,0,null,0,null,54233]
["A359 PS17","KASTAMONU A359 PS17 Csereszny",2800,2070,18,"IGEN",-4,0,0,0,0,0,0,0,0,null,0,null,54234]
["A373 PS11","KASTAMONU A373 PS11 Latin Dio",2800,2070,18,"IGEN",0,0,0,0,0,0,0,0,0,null,0,null,54238]
["A379 PS11","KASTAMONU A379 PS11 Bambusz",2800,2070,18,"IGEN",-11,0,0,0,0,0,0,0,0,null,0,null,54258]
["A380 PS11","KASTAMONU A380 Samba",2800,2070,18,"IGEN",0,0,0,0,0,0,0,0,0,null,0,null,54259]
["A391 PS19","KASTAMONU PS19 Makasár Ében",2800,2070,18,"IGEN",0,0,0,0,0,0,0,0,0,null,0,null,54240]
["A392 PS19","KASTAMONU A392 Palissander",2800,2070,18,"IGEN",0,0,0,0,0,0,0,0,0,null,0,null,54241]
["A394 PS12","KASTAMONU A394 Light Zebrano",2800,2070,18,"IGEN",-6,0,0,0,0,0,0,0,0,null,0,null,54242]
["A395 PS19","KASTAMONU A395 PS19 Cordoba",2800,2070,18,"IGEN",-1,0,0,0,0,0,0,0,0,null,0,null,54261]
["A396/36","KASTAMONU A396 Carmen",2800,2070,36,"IGEN",-6,0,0,0,0,0,0,0,0,null,0]
["A396PS19","KASTAMONU A396 Carmen",2800,2070,18,"IGEN",-1,0,0,0,0,0,0,0,0,null,0,null,54262]
["A398 PS17","KASTAMONU A398 Olasz Dió",2800,2070,18,"IGEN",0,0,0,0,0,0,0,0,0,null,0,null,54243]
["A400 PS19","KASTAMONU A400 PS19 Sötét zabrano",2800,2070,18,"IGEN",-1,0,0,0,0,0,0,0,0,null,0,null,54244]
["A411 PS19","KASTAMONU A411 Sakarya",2800,2070,18,"IGEN",0,0,0,0,0,0,0,0,0,null,0,null,54263]
["A414 PS19","KASTAMONU A414 PS19 Antracit",2800,2070,18,"IGEN",-3,0,0,0,0,0,0,0,0,null,0,null,54264]
["A415 PS19","KASTAMONU A415 Bianco",2800,2070,18,"IGEN",-1,0,0,0,0,0,0,0,0,null,0,null,54265]
["A416 PS11","KASTAMONU A416 PS11 Nevada",2800,2070,18,"IGEN",-7,0,0,0,0,0,0,0,0,null,0,null,54266]
["A418 PS11","KASTAMONU A418 PS11 Light Saphire",2800,2070,18,"IGEN",-6,0,0,0,0,0,0,0,0,null,0,null,54267]
["A419 PS11","KASTAMONU A419 Sapire Tölgy",2800,2070,18,"IGEN",0,0,0,0,0,0,0,0,0,null,0,null,54268]
["A423 PS13","KASTAMONU A 423 San remo",2800,2070,18,"IGEN",-18,0,0,0,0,0,0,0,0,null,0,null,54379]
["A439 PS11","KASTAMONU A439 PS11 Ibiza",2800,2070,18,"IGEN",0,0,0,0,0,0,0,0,0,null,0,null,54341]
["A800 PS17","KASTAMONU A800 Cseresznye",2800,2070,18,"IGEN",-2,0,0,0,0,0,0,0,0,null,0,null,54204]
["A801 PS11","KASTAMONU A801 Oxford Cseri",2800,2070,18,"IGEN",0,0,0,0,0,0,0,0,0,null,0,null,54217]
["A802 PS17","KASTAMONU A802 PS17 Sam bükk",2800,2070,18,"IGEN",-1,0,0,0,0,0,0,0,0,null,0,null,54205]
["A803 PS17","KASTAMONU A803 PS17 Éger",2800,2070,18,"IGEN",-8,0,0,0,0,0,0,0,0,null,0,null,54206]
["A804 PS17","KASTAMONU A 804 PS17 Sanoma tölgy",2800,2070,18,"IGEN",0,0,0,0,0,0,0,0,0,null,0,null,54246]
["A805 PS17","KASTAMONU A805 PS17 Canterbury",2800,2070,18,"IGEN",0,0,0,0,0,0,0,0,0,null,0,null,54247]
["A806 PS11","KASTAMONU A806 Marburg tölgy",2800,2070,18,"IGEN",-9,0,0,0,0,0,0,0,0,null,0,null,54224]
["A807 PS11","KASTAMONU A807 PS11 Svájci sz",2800,2070,18,"IGEN",0,0,0,0,0,0,0,0,0,null,0,null,54207]
["A808 PS11","KASTAMONU A808 PS11 Windsor tölgy",2800,2070,18,"IGEN",0,0,0,0,0,0,0,0,0,null,0,null,54248]
["A809 PS11","KASTAMONU A809 PS11 Moldáv Akác",2800,2070,18,"IGEN",-7,0,0,0,0,0,0,0,0,null,0,null,54249]
["A810 PS11","KASTAMONU A810 Cherry Morgana",2800,2070,18,"IGEN",-6,0,0,0,0,0,0,0,0,null,0,null,54225]
["A811 PS11","KASTAMONU A811 PS11 Aida Dió",2800,2070,18,"IGEN",-25,0,0,0,0,0,0,0,0,null,0,null,54250]
["A811PS11 36","KASTAMONU A811 PS11 Aida dió",2800,2070,36,"IGEN",0,0,0,0,0,0,0,0,0,null,0]
["A812 PS17","KASTAMONU A 812 Serwwod tölgy",2800,2070,18,"IGEN",0,0,0,0,0,0,0,0,0,null,0,null,54252]
["A814 PS17","KASTAMONU A814 Spessarti tölgy",2800,2070,18,"IGEN",-1,0,0,0,0,0,0,0,0,null,0,null,54226]
["A815PS17","KASTAMONU A815 Toscana Fenyő",2800,2070,18,"IGEN",-10,0,0,0,0,0,0,0,0,null,0,null,54208]
["A816 PS10","KASTAMONU A816 Mézgás Éger",2800,2070,18,"IGEN",0,0,0,0,0,0,0,0,0,null,0,null,54235]
["A817 PS11","KASTAMONU A817 PS11 Wenge",2800,2070,18,"IGEN",0,0,0,0,0,0,0,0,0,null,0,null,54212]
["A818 PS17","KASTAMONU A818 PS17 Bavaria",2800,2070,18,"IGEN",0,0,0,0,0,0,0,0,0,null,0,null,54209]
["A818 PS17 25","KASTAMONU A818 Bavaria bükk",2800,2070,25,"IGEN",0,0,0,0,0,0,0,0,0,null,0]
["A819 PS17","KASTAMONU A819 Maiami tölgy",2800,2070,18,"IGEN",0,0,0,0,0,0,0,0,0,null,0,null,54213]
["A820 PS19","KASTAMONU A820 Opál Tölgy",2800,2070,18,"IGEN",-14,0,0,0,0,0,0,0,0,null,0,null,5426]
["A821 PS17","KASTAMONU A821 Tölgy",2800,2070,18,"IGEN",-7,0,0,0,0,0,0,0,0,null,0,null,54227]
["A822 PS 11","KASTAMONU A822 PS11 Dalmát di",2800,2070,18,"IGEN",-4,0,0,0,0,0,0,0,0,null,0,null,54245]
["A824 PS17","KASTAMONU A824 Rusztikus Tölgy",2800,2070,18,"IGEN",-3,0,0,0,0,0,0,0,0,null,0,null,54214]
["A825 PS17","KASTAMONU A825 PS17 Mogyoró",2800,2070,18,"IGEN",-6,0,0,0,0,0,0,0,0,null,0,null,54215]
["A826 PS19","KASTAMONU A826   PS 19 Larico Pine",2800,2070,18,"IGEN",0,0,0,0,0,0,0,0,0,null,0,null,54254]
["A827 PS11","KASTAMONU A827 PS11 Nyír",2800,2070,18,"IGEN",-21,0,0,0,0,0,0,0,0,null,0,null,54218]
["A829 PS19","KASTAMONU A829 Világos perrie",2800,2070,18,"IGEN",-13,0,0,0,0,0,0,0,0,null,0,null,54255]
["A830 PS19","KASTAMONU A830 Sötét Perrier",2800,2070,18,"IGEN",-6,0,0,0,0,0,0,0,0,null,0,null,54256]
["A831 PS17","KASTAMONU A831 PS17 Kantori t",2800,2070,18,"IGEN",-5,0,0,0,0,0,0,0,0,null,0,null,54228]
["A831PS17","KASTAMONU A831 PS17 Kantori t",2800,2070,18,"IGEN",0,0,0,0,0,0,0,0,0,null,0,null,54228]
["A832 PS17","KASTAMONU A 832 PS17 Mahagóni",2800,2070,18,"IGEN",0,0,0,0,0,0,0,0,0,null,0,null,54216]
["A833 PS17","KASTAMONU A833 Grande tölgy",2800,2070,18,"IGEN",-18,0,0,0,0,0,0,0,0,null,0,null,54220]
["A834 PS11","KASTAMONU A834 Vadkörte",2800,2070,18,"IGEN",0,0,0,0,0,0,0,0,0,null,0,null,54237]
["A835 PS11","KASTAMONU A835 Calvados",2800,2070,18,"IGEN",0,0,0,0,0,0,0,0,0,null,0,null,54210]
["A836 PS11","KASTAMONU A836 Csoki bükk",2800,2070,18,"IGEN",-4,0,0,0,0,0,0,0,0,null,0,null,54229]
["A837 PS11","KASTAMONU A837 Világos körte",2800,2070,18,"IGEN",0,0,0,0,0,0,0,0,0,null,0]
["A838 PS19","KASTAMONU A838 PS19 Nero",2800,2070,18,"IGEN",0,0,0,0,0,0,0,0,0,null,0,null,54269]
["A839 PS19","KASTAMONU A839 PS19 Creme",2800,2070,18,"IGEN",0,0,0,0,0,0,0,0,0,null,0,null,54270]
["A842 PS19","KASTAMONU A842 Sonoma",2800,2070,18,"IGEN",0,0,0,0,0,0,0,0,0,null,0,null,54399]
["A844 PS13","KASTAMONU A844 Sötét vörösfenyő",2800,2070,18,"IGEN",-32,0,0,0,0,0,0,0,0,null,0,null,54342]
["A845 ST13","KASTAMONU A845 PS13 ELM",2800,2070,18,"IGEN",-4,0,0,0,0,0,0,0,0,null,0,null,54340]
["A846 PS11","KASTAMONU A846 PS11 Corvara Bükk",2800,2070,18,"IGEN",-10,0,0,0,0,0,0,0,0,null,0,null,54356]
["A847 PS19","KASTAMONU A847 Tölgy",2800,2070,18,"IGEN",-4,0,0,0,0,0,0,0,0,null,0,null,54355]
["A860 PS13","KASTAMONU A860 Korona Tölgy",2800,2070,18,"IGEN",0,0,0,0,0,0,0,0,0,null,0,null,54477]
["A865 PS 19","KASTAMONU A865    Angol tölgy",2800,2070,18,"IGEN",0,0,0,0,0,0,0,0,0,null,0,null,54387]
["AGT633","AGT 633 Imperia",2800,1220,18,"IGEN",0,0,0,0,0,0,0,0,0,null,0,null,540633]
["AGT647","AGT647 Cream",2800,1220,18,"NEM",0,0,0,0,0,0,0,0,0,null,0,null,540647]
["AGT680","AGT 680",2800,1220,18,"IGEN",0,0,0,0,0,0,0,0,0,null,0,null,540680]
["Akril 001","KASTAMONU Akril Fehér 001",2800,1220,18,"NEM",-8,0,0,0,0,0,0,0,0,null,0]
["Akril lap","AKRIL Lap",2800,1310,19,"NEM",0,0,0,0,0,0,0,0,0,null,0]
["BY322 SWN","Santana Tölgy",2800,2070,18,"IGEN",0,0,0,0,0,0,0,0,0,null,0]
["BY351","BY 351 Sötét Sonoma",2800,2070,18,"IGEN",0,0,0,0,0,0,0,0,0,null,0]
["BY358 SWN","Yukon Tölgy",2800,2070,18,"IGEN",0,0,0,0,0,0,0,0,0,null,0]
["BY601/16 SM","Fehér 16mm",2800,2070,16,"NEM",0,0,0,0,0,0,0,0,0,null,0]
["BY605 SM","Front Fehér 18mm",2800,2070,18,"NEM",0,0,0,0,0,0,0,0,0,null,0]
["Corian","Corian",3660,760,12,"NEM",0,0,0,0,0,0,0,0,0,null,0]
["D102 PS14","KASTAMONU D102 PS14 Beige",2800,2070,18,"NEM",-11,0,0,0,0,0,0,0,0,null,0,null,54251]
["D104 PS11","KASTAMONU D104 PS11 Yvori",2800,2070,18,"NEM",0,0,0,0,0,0,0,0,0,null,0,null,54271]
["D107 PS14","54300 KASTAMONU D107 Prégelt fekete",2800,2070,18,"NEM",-34,0,0,0,0,0,0,0,0,null,0,null,54202]
["D108 PS11","KASTAMONU D108 PS11 Blue",2800,2070,18,"NEM",-13,0,0,0,0,0,0,0,0,null,0,null,54272]
["D114 PS11","KASTAMONU  D114 PS11 Orange",2800,2070,18,"NEM",0,0,0,0,0,0,0,0,0,null,0,null,54284]
["D116 PS14","KASTAMONU D116 Metál szürke",2800,2070,18,"IGEN",-2,0,0,0,0,0,0,0,0,null,0,null,54279]
["D117 PS11","KASTAMONU D117 PS11 Piros",2800,2070,18,"NEM",-1,0,0,0,0,0,0,0,0,null,0,null,54285]
["D118 PS14","KASTAMONU D118 Vanília",2800,2070,18,"NEM",-57,0,0,0,0,0,0,0,0,null,0,null,54273]
["D122  PS14","KASTAMONU  D122 Mink",2800,2070,1.8,"NEM",-10,0,0,0,0,0,0,0,0,null,0,null,54275]
["D123 PS14","KASTSAMONU D123 PS14 Vil. szü",2800,2070,18,"NEM",0,0,0,0,0,0,0,0,0,null,0,null,54301]
["D123 PS14 25","KASTAMONU D123 PS14 Vil. szür",2800,2070,25,"NEM",0,0,0,0,0,0,0,0,0,null,0]
["D125 PS11","KASTAMONU D 125 PS 11 Rózsaszín",2800,2070,18,"NEM",-2,0,0,0,0,0,0,0,0,null,0,null,54360]
["D126 PS14","KASTAMONU D126 Cappuccino",2800,2070,18,"NEM",0,0,0,0,0,0,0,0,0,null,0,null,54299]
["D129 PS14","KASTAMONU D129 PS14 Front feh",2800,2070,18,"NEM",0,0,0,0,0,0,0,0,0,null,0,null,54354]
["D129 PS17","KASTAMONU D129 PS17Erezett fehér",2800,2070,18,"IGEN",-28,0,0,0,0,0,0,0,0,null,0,null,54359]
["D133 PS11","KASTAMONU D133  PS11 Sárga",2800,2070,18,"NEM",-7,0,0,0,0,0,0,0,0,null,0,null,54286]
["D134 PS11","KASTAMONU D134 Zöld",2800,2070,18,"NEM",-2,0,0,0,0,0,0,0,0,null,0,null,54287]
["D138 PS11","KASTAMONU D138 PS11 Lila",2800,2070,18,"NEM",0,0,0,0,0,0,0,0,0,null,0,null,54281]
["D143 PS14","KASTAMONU D143  PS14Antracit",2800,2070,18,"NEM",-3,0,0,0,0,0,0,0,0,null,0,null,54282]
["D145 PS14","KASTAMONU D145 PS14 Bronz",2800,2070,18,"NEM",0,0,0,0,0,0,0,0,0,null,0,null,54289]
["D147 PS14","KASTAMONU D147 PS14 Bíbor",2800,2070,18,"NEM",-2,0,0,0,0,0,0,0,0,null,0,null,54290]
["D149 PS14","KASTAMONU D149 PS14 Bordó",2800,2070,18,"NEM",0,0,0,0,0,0,0,0,0,null,0,null,54292]
["D150 PS11","Kastamonu D150 Tenger kék",2800,2070,18,"NEM",0,0,0,0,0,0,0,0,0,null,0,null,54293]
["D152 SM10","KASTAMONU D152 SM10 Fehér",2800,2070,18,"NEM",0,0,0,0,0,0,0,0,0,null,0,null,54400]
["D152 SM12","KASTAMONU D152 SM12 Fehér",2800,2070,12,"IGEN",-4,0,0,0,0,0,0,0,0,null,0,null,54211]
["D152 SM16","KASTAMUNU D152 SM16 Fehér",2800,2070,16,"NEM",0,0,0,0,0,0,0,0,0,null,0,null,54278]
["D152 SM18","54201 KASTAMONU D152 SM18  Fehér",2800,2070,18,"NEM",-559,0,0,0,0,0,0,0,0,null,0,null,54201]
["D152 SM25","KASTAMONU D152 SM 25  Fehér",2800,2070,25,"NEM",0,0,0,0,0,0,0,0,0,null,0,null,54325]
["D152 SM8","KASTAMONU D152 SM8 fehér",2800,2070,8,"NEM",0,0,0,0,0,0,0,0,0,null,0,null,54401]
["D158 PS 11","KASTAMONU D158 PS11 Galaxy",2800,2070,18,"NEM",-3,0,0,0,0,0,0,0,0,null,0,null,54298]
["D164","KASTAMONU D164 Luna",2800,2070,18,"NEM",0,0,0,0,0,0,0,0,0,null,0]
["D300 PS14","KASTAMONU D300  PS14 Szürkés fehér",2800,2070,18,"NEM",0,0,0,0,0,0,0,0,0,null,0,null,54283]
["D301 PS11","KASTAMONU Silver",2800,2070,18,"NEM",-221,0,0,0,0,0,0,0,0,null,0,null,54294]
["D302PS13","KASTSAMONU D302 PS13 Krém",2800,2070,18,"NEM",0,0,0,0,0,0,0,0,0,null,0,null,54491]
["D304 PS13","KASTAMONU D304 PS13 Zöld Pisztácia",2800,2070,18,"NEM",0,0,0,0,0,0,0,0,0,null,0,null,54326]
["D6782","SKIN Olmo Jerez Scoro SG/SG",2800,2070,18,"IGEN",0,0,0,0,0,0,0,0,0,null,0,null,54595]
["Dekor","Dekor",2790,2060,3,"IGEN",0,0,0,0,0,0,0,0,0,null,0]
["F 242 PS10","KASTAMONU F242 Flover",2800,2070,18,"IGEN",0,0,0,0,0,0,0,0,0,null,0,null,54461]
["F 275 ST9","EGGER F275 ST9 Sötét beton",2800,2070,18,"NEM",0,0,0,0,0,0,0,0,0,null,0,null,53420]
["F0075 SZÜR","FUNDERMAX SG/SF Fényes szürke",2800,2050,19,"NEM",0,0,0,0,0,0,0,0,0,null,0,null,54608]
["F0080 FEK","FUNDERMAX SG/SF Fényes fekete",2800,2050,18,"NEM",0,0,0,0,0,0,0,0,0,null,0,null,54603]
["F0080 FEK 36","FUNDERMAX SG/SF Fekete fényes",2750,1830,37,"NEM",0,0,0,0,0,0,0,0,0,null,0]
["F0085 FEH","FUNDERMAX SG/SF Fényes fehér",2800,2050,19,"NEM",-10,0,0,0,0,0,0,0,0,null,0,null,54601]
["F0085 FEH 36","FUNDERMAX  SG/SF Fényes Fehér",2750,1830,37,"NEM",0,0,0,0,0,0,0,0,0,null,0]
["F0334 SG","FUNDERMAX SG/SF Fényes Zebránó",2800,2050,19,"IGEN",0,0,0,0,0,0,0,0,0,null,0,null,54612]
["F0794 GA","FUNDERMAX 0794 Platina Bronz",2800,2050,18,"IGEN",0,0,0,0,0,0,0,0,0,null,0,null,540794]
["F0851 Bézs","FUNDERMAX SG/SF Fényes Bézs",2800,2050,19,"NEM",0,0,0,0,0,0,0,0,0,null,0,null,54607]
["F186 ST9","EGGER F186 Vill. Beton",2800,2070,18,"IGEN",0,0,0,0,0,0,0,0,0,null,0]
["F187 ST9","EGGER F187 ST9 Sötét szürke Chicago beto",2800,2070,18,"IGEN",0,0,0,0,0,0,0,0,0,null,0,null,53629]
["F236 ST 15","MUNKALAP Terrano Grey",2500,600,28,"IGEN",0,0,0,0,0,0,0,0,0,null,0]
["F238 PS11","KASTAMONU F238 GRAY TREND",2800,2070,18,"IGEN",0,0,0,0,0,0,0,0,0,null,0,null,54614]
["F239 PS11","KASTAMONU F239 Beige Trend",2800,2070,18,"IGEN",0,0,0,0,0,0,0,0,0,null,0,null,54339]
["F242 PS10","KASTAMONU F242 PS10 Flower",2800,2070,18,"NEM",0,0,0,0,0,0,0,0,0,null,0,null,54461]
["F274 ST9","EGGER Beton F274 ST9",2800,2070,18,"IGEN",0,0,0,0,0,0,0,0,0,null,0,null,53419]
["F275 ST2","EGGER F275 ST2 Sötét Beton",2800,2070,18,"NEM",0,0,0,0,0,0,0,0,0,null,0,null,53420]
["F310 ST 87","EGGER F 310 ST 87 Rozsda Kerá",2800,2070,18,"IGEN",0,0,0,0,0,0,0,0,0,null,0,null,53524]
["F425 ST10","EGGER F425 ST10 Bézs Len",2800,2070,18,"IGEN",0,0,0,0,0,0,0,0,0,null,0]
["F501 ST2","EGGER F501 ST2  Titán",2800,2070,18,"IGEN",-14,0,0,0,0,0,0,0,0,null,0,null,53423]
["F509 ST2","EGGER F509 ST2 Aluminium",2800,2070,18,"IGEN",0,0,0,0,0,0,0,0,0,null,0,null,53424]
["F535 FS22","FALCO 535 FS22 Ardeni Fenyő",2800,2070,18,"IGEN",-3,0,0,0,0,0,0,0,0,null,0,null,53044]
["F583 ST22","EGGER F583 ST22 Fino Bronz",2800,2070,18,"IGEN",0,0,0,0,0,0,0,0,0,null,0,null,53425]
["F605 FS22","FALCO 605 FS22 Arusha Wenge Világos",2800,2070,18,"IGEN",0,0,0,0,0,0,0,0,0,null,0]
["FAL 245 FS08","FALCO F245 FS08 Pacific",2800,2070,18,"NEM",0,0,0,0,0,0,0,0,0,null,0]
["FAL 418 FS24","FALCO 418 FS24 Vancover Juhar",2800,2070,18,"IGEN",0,0,0,0,0,0,0,0,0,null,0,null,53010]
["FAL 428 FS24","FALCO 428 Vörös mahagóni",2650,2070,18,"IGEN",0,0,0,0,0,0,0,0,0,null,0,null,53024]
["FAL 540 FS08","FALCO 540 FS08  Samoa Teak Világos",2800,2070,18,"IGEN",0,0,0,0,0,0,0,0,0,null,0,null,53121]
["FAL 584 FS22","FALCO 584 FS22 Yorki Tölgy",2800,2070,18,"IGEN",-4,0,0,0,0,0,0,0,0,null,0,null,53038]
["FAL 604 ST22","FALCO 604 FS22 Arusha Wenge Sötét",2800,2070,18,"IGEN",0,0,0,0,0,0,0,0,0,null,0,null,53104]
["FAL 611 FS22","FALCO 611 FS22 Luna Szil",2800,2070,18,"IGEN",0,0,0,0,0,0,0,0,0,null,0,null,53105]
["FAL 698 FS22","FALCO 698 FS22 18 Söt Raun Szil.",2800,2070,18,"IGEN",0,0,0,0,0,0,0,0,0,null,0,null,53061]
["FAL 854 FS15","FALCO 854 FS15 Wenge",2800,2070,18,"IGEN",-1,0,0,0,0,0,0,0,0,null,0,null,53060]
["FAL103 FS02","FALCO 103 FS31 Erezett fehér",2800,2070,18,"IGEN",0,0,0,0,0,0,0,0,0,null,0,null,53008]
["FAL105 FS22","FALCO 105FS22 Hófehér",2800,2070,18,"IGEN",0,0,0,0,0,0,0,0,0,null,0]
["FAL116 SM","FALCO 116 SM 16 Korpuszfehér",2800,2070,16,"NEM",0,0,0,0,0,0,0,0,0,null,0,null,53011]
["FAL200 FS02","FALCO 200FS02 Prégelt fekete",2800,2070,18,"NEM",-1,0,0,0,0,0,0,0,0,null,0,null,53007]
["FAL200FS31","FALCO 200FS 31 Fekete Erezett",2800,2070,18,"IGEN",-4,0,0,0,0,0,0,0,0,null,0,null,53088]
["FAL213 FS15","FALCO 213 FS15 KÉK",2800,2070,18,"NEM",0,0,0,0,0,0,0,0,0,null,0,null,53844]
["FAL215 ST2","FALCO 215 ST2 Narancs",2800,2070,18,"NEM",0,0,0,0,0,0,0,0,0,null,0,null,53200]
["FAL219FS15","FALCO 219 FS15 Pisztácia",2800,2070,18,"NEM",0,0,0,0,0,0,0,0,0,null,0]
["FAL271 FS02","FALCO 271 Antracit",2800,2070,18,"NEM",-6,0,0,0,0,0,0,0,0,null,0,null,53308]
["FAL301 FS08","FALCO 301 FS08 Capuccino",2800,2070,18,"NEM",0,0,0,0,0,0,0,0,0,null,0,null,53301]
["FAL303 FS02","FALCO 303 FS02 Ezüst",2800,2070,18,"NEM",0,0,0,0,0,0,0,0,0,null,0]
["FAL307 FS02","FALCO 307 FS02 Pasztell Sárga",2800,2070,18,"NEM",0,0,0,0,0,0,0,0,0,null,0,null,53307]
["FAL314 FS02","FALCO 314 FS02 Világos szürke",2800,2070,18,"NEM",-5,0,0,0,0,0,0,0,0,null,0,null,53043]
["FAL329 FS02","FALCO 329 FS02 Sárgás Beige",2800,2070,18,"NEM",0,0,0,0,0,0,0,0,0,null,0,null,53028]
["FAL344 FS02","FALCO 344 Beige",2650,2070,18,"NEM",0,0,0,0,0,0,0,0,0,null,0,null,53001]
["FAL348 FS02","FALCO 348 Krém",2800,2070,18,"NEM",0,0,0,0,0,0,0,0,0,null,0,null,53032]
["FAL403 FS24","FALCO 403 Sötét kal. cseri",2800,2070,18,"IGEN",-7,0,0,0,0,0,0,0,0,null,0,null,53023]
["FAL404 FS24","FALCO 404 Cseresznye",2800,2070,18,"IGEN",0,0,0,0,0,0,0,0,0,null,0,null,53005]
["FAL410 FS24","FALCO 410 Bió Fenyő",2800,2070,18,"IGEN",0,0,0,0,0,0,0,0,0,null,0,null,53012]
["FAL415 FS24","FALCO 415 FS24 Lanty Tölgy",2800,2070,18,"IGEN",0,0,0,0,0,0,0,0,0,null,0,null,53013]
["FAL417 FS15","FALCO 417 FS15 Wenge",2800,2070,18,"IGEN",0,0,0,0,0,0,0,0,0,null,0,null,53037]
["FAL418 FS24","FALCO 418 FS24 Vancuver Juhar",2800,2070,18,"IGEN",0,0,0,0,0,0,0,0,0,null,0,null,53010]
["FAL419 FS24","FALCO 419 Világos fenyő",2650,2070,18,"IGEN",0,0,0,0,0,0,0,0,0,null,0,null,53014]
["FAL422 FS15","FALCO 422 Mogyoró",2650,2070,18,"IGEN",0,0,0,0,0,0,0,0,0,null,0,null,53026]
["FAL438","FALCO 438 Világos Bükk",2800,2070,18,"IGEN",0,0,0,0,0,0,0,0,0,null,0,null,53002]
["FAL438 FS24","FALCO 438 Világos bükk",2650,2070,18,"IGEN",0,0,0,0,0,0,0,0,0,null,0,null,53002]
["FAL440  FS08","FALCO 440 FS08 Havas Kőris",2800,2070,18,"IGEN",0,0,0,0,0,0,0,0,0,null,0,null,53245]
["FAL444 FS24","FALCO 444 FS24 Éfer",2800,2070,18,"IGEN",0,0,0,0,0,0,0,0,0,null,0,null,53244]
["FAL458 FS24","FALCO 458 FS24 Antik cseresznye",2800,2070,18,"IGEN",0,0,0,0,0,0,0,0,0,null,0,null,53360]
["FAL459 FS15","FALCO 459 FS15 Dió Extra",2800,2070,18,"IGEN",0,0,0,0,0,0,0,0,0,null,0,null,53359]
["FAL461 FS24","FALCO 461 ST24 Country Bükk",2800,2070,18,"IGEN",0,0,0,0,0,0,0,0,0,null,0,null,53009]
["FAL463 FS24","FALCO 463 Európai juhar",2650,2070,18,"IGEN",0,0,0,0,0,0,0,0,0,null,0,null,53006]
["FAL466 FS15","FALCO 764 Sötét alma",2800,2070,18,"IGEN",0,0,0,0,0,0,0,0,0,null,0,null,53066]
["FAL468 FS15","FALCO 468 Olasz alma",2650,2070,18,"IGEN",0,0,0,0,0,0,0,0,0,null,0,null,53017]
["FAL474 FS24","FALCO Sötét Royal Tölgy",2650,2070,18,"IGEN",0,0,0,0,0,0,0,0,0,null,0,null,53022]
["FAL476 FS15","FALCO 476 FS15 Color Dió",2800,2070,18,"IGEN",0,0,0,0,0,0,0,0,0,null,0,null,53029]
["FAL489 FS15","FALCO 489 Sötét calvados",2650,2070,18,"IGEN",0,0,0,0,0,0,0,0,0,null,0,null,53003]
["FAL508 FS15","FALCO 508 FS15 Sötét L Dió",2800,2070,18,"IGEN",0,0,0,0,0,0,0,0,0,null,0,null,53062]
["FAL515 FS22","FALCO 515 FS22 Ardeni Fenyő",2800,2070,18,"IGEN",-7,0,0,0,0,0,0,0,0,null,0,null,53027]
["FAL518 FS22","FALCO 518 FS22",2800,2070,18,"IGEN",0,0,0,0,0,0,0,0,0,null,0,null,535180]
["FAL521 FS24","FALCO 521 FS24 Miláno tölgy",2800,2070,18,"IGEN",0,0,0,0,0,0,0,0,0,null,0,null,53019]
["FAL524 FS24","FALCO 524 FS24 Érett tölgy",2800,2070,18,"IGEN",-2,0,0,0,0,0,0,0,0,null,0,null,53021]
["FAL531 FS15","FALCO 531 FS15 Alpesi bükk",2650,2070,18,"IGEN",0,0,0,0,0,0,0,0,0,null,0]
["FAL537 FS15","FALCO 537 FS15 Baltimore dió",2650,2070,18,"IGEN",0,0,0,0,0,0,0,0,0,null,0,null,53018]
["FAL538 FS22","FALCO 538 FS22 Salzburgi Fenyő",2800,2070,18,"IGEN",0,0,0,0,0,0,0,0,0,null,0,null,536120]
["FAL539 FS22","FALCO 539 FS22 Antik Fenyő",2800,2070,18,"IGEN",0,0,0,0,0,0,0,0,0,null,0,null,53122]
["FAL540 FS08","FALCO 540 Sanoma teak világos",2800,2070,18,"IGEN",0,0,0,0,0,0,0,0,0,null,0,null,53121]
["FAL541 FS08","FALCO 541 FS08 Samoa teak sötét",2800,2070,18,"IGEN",0,0,0,0,0,0,0,0,0,null,0,null,53020]
["FAL542 FS22","FALCO Forgácslao 542 FS22 Winchester dio",2800,2070,18,"IGEN",0,0,0,0,0,0,0,0,0,null,0,null,53324]
["FAL551 FS15","FALCO 551 FS15 Sötét szilva",2800,2070,18,"IGEN",0,0,0,0,0,0,0,0,0,null,0,null,53155]
["FAL553 FS 15","FALCO 553 FS 15  Alföldi Szilva",2800,2070,18,"IGEN",0,0,0,0,0,0,0,0,0,null,0]
["FAL570 FS31","FALCO 570 FS31 Déli Kőris",2800,2070,18,"IGEN",-1,0,0,0,0,0,0,0,0,null,0,null,53309]
["FAL571 FS31","FALCO 571 FS31 Bajor Kőris",2800,2070,18,"IGEN",-6,0,0,0,0,0,0,0,0,null,0,null,56028]
["FAL572 FS22","FALCO 572 Coimbra kőris",2650,2070,18,"IGEN",0,0,0,0,0,0,0,0,0,null,0]
["FAL573 FS24","FALCO 573 Centerbury tölgy",2800,2070,18,"IGEN",0,0,0,0,0,0,0,0,0,null,0,null,53173]
["FAL577 FS22","FALCO 577 FS22 Sanoma tölgy",2800,2070,18,"IGEN",0,0,0,0,0,0,0,0,0,null,0,null,53030]
["FAL578 FS22","FALCO 578 FS22 Sanoma tölgy b",2800,2070,18,"IGEN",-3,0,0,0,0,0,0,0,0,null,0,null,53031]
["FAL582 FS22","FALCO 582 FS22 River Tölgy",2800,2070,18,"IGEN",0,0,0,0,0,0,0,0,0,null,0,null,53035]
["FAL583 FS22","FALCO 583 FS22 Spanyol Tölgy",2800,2070,18,"IGEN",-13,0,0,0,0,0,0,0,0,null,0,null,530169]
["FAL584 FS22","FALCO 584 FS22 Yorky Tölgy",2800,2070,18,"IGEN",-4,0,0,0,0,0,0,0,0,null,0,null,53038]
["FAL586 FS22","FALCO 586 FS22 Csoko Sonoma",2800,2070,18,"IGEN",0,0,0,0,0,0,0,0,0,null,0,null,53033]
["FAL600 FS22","FALCO 600 Fényes dió barna",2800,2070,18,"IGEN",0,0,0,0,0,0,0,0,0,null,0]
["FAL602 FS 15","FALCO 602 FS 15  Gangesz",2800,2070,18,"IGEN",0,0,0,0,0,0,0,0,0,null,0]
["FAL605 FS22","FALCO 605 FS22 Arusha Wenge",2800,2070,18,"IGEN",-2,0,0,0,0,0,0,0,0,null,0]
["FAL611 FS 21","FALCO 611 ST21 Luna Szil",2800,2070,18,"IGEN",-4,0,0,0,0,0,0,0,0,null,0,null,53105]
["FAL616 FS08","FALCO 616 FS Gyöngy Calobra",2800,2070,18,"IGEN",-3,0,0,0,0,0,0,0,0,null,0,null,53362]
["FAL623 FS22","FALCO 623 FS22 Vil.Monaco Tölgy",2800,2070,18,"IGEN",0,0,0,0,0,0,0,0,0,null,0]
["FAL637 FS15","FALCO 637 Éger",2650,2070,18,"IGEN",0,0,0,0,0,0,0,0,0,null,0,null,53004]
["FAL649 FS50","FALCO 649 Sötét ciprus",2800,2070,18,"IGEN",-1,0,0,0,0,0,0,0,0,null,0,null,53361]
["FAL658 FS08","FALCO 658 Kaukázusi nyír",2800,2070,18,"IGEN",0,0,0,0,0,0,0,0,0,null,0,null,53058]
["FAL697 FS22","FALCO 697 Világos Szil",2800,2070,18,"IGEN",0,0,0,0,0,0,0,0,0,null,0,null,53059]
["FAL698 FS22","FALCO 611 Sötét szil",2800,2070,18,"IGEN",-5,0,0,0,0,0,0,0,0,null,0,null,53061]
["FAL727 FS15","FALCO 727 FS15 Beige Textil",2800,2070,18,"IGEN",-13,0,0,0,0,0,0,0,0,null,0,null,53036]
["FAL764 ST15","FALCO 764 ST15 Vadkörte",2800,2070,18,"IGEN",-2,0,0,0,0,0,0,0,0,null,0,null,53015]
["FAL9775FS24","FALCO 9775 ST15 Zebrano",2800,2070,18,"IGEN",0,0,0,0,0,0,0,0,0,null,0,null,53025]
["FALM105","FALCO M105 Fényes Fehér",2800,2050,18,"NEM",0,0,0,0,0,0,0,0,0,null,0,null,53000]
["FALM348 FS70","FALCO M348 FS70 Magasfényű ivory",2800,2070,18,"NEM",0,0,0,0,0,0,0,0,0,null,0]
["H1006","EGGER H1006 Cremona tölgy",2800,2070,18,"IGEN",0,0,0,0,0,0,0,0,0,null,0,null,53348]
["H1113 ST10","EGGER H1114 ST10 Barna Kansas Tölgy",2800,2070,18,"IGEN",0,0,0,0,0,0,0,0,0,null,0,null,53613]
["H1115 ST12","EGGER H1115 ST12 Szürkés Bamenda",2800,2070,18,"IGEN",0,0,0,0,0,0,0,0,0,null,0]
["H1129 ST15","EGGER H1129 Thermo tölgy",2800,2070,18,"IGEN",0,0,0,0,0,0,0,0,0,null,0,null,53432]
["H1137 ST11","EGGER ST11 Csoki tölgy",2800,2070,18,"IGEN",-5,0,0,0,0,0,0,0,0,null,0,null,53587]
["H1145 ST10","EGGER H1145 Bordolíno tölgy",2800,2070,18,"IGEN",0,0,0,0,0,0,0,0,0,null,0,null,53556]
["H1146 ST10","EGGER H1146 ST10 Szürke Tölgy",2800,2070,18,"IGEN",0,0,0,0,0,0,0,0,0,null,0,null,53433]
["H1151 ST10","EGGER H1151 Autentikus tölgy",2800,2070,18,"IGEN",0,0,0,0,0,0,0,0,0,null,0,null,53434]
["H1180 ST37","EGGER H1180 ST37 Halifax Natur Tölgy",2800,2070,18,"IGEN",-12,0,0,0,0,0,0,0,0,null,0,null,53580]
["H1181 ST37","EGGER H1181 ST37 Dohány Tölgy",2800,2070,18,"IGEN",-1,0,0,0,0,0,0,0,0,null,0,null,53558]
["H1212 ST33","EGGER H1212 ST33 Tossíni barna szíl",2800,2070,18,"IGEN",0,0,0,0,0,0,0,0,0,null,0,null,53586]
["H1213 ST33","EGGER H1213 ST33 Tossíni natur szil",2800,2070,18,"IGEN",0,0,0,0,0,0,0,0,0,null,0,null,53585]
["H1232 ST9","EGGER H1232 ST9 Loire Kőris",2800,2070,18,"IGEN",0,0,0,0,0,0,0,0,0,null,0]
["H1277 ST9","EGGER H1277 ST9 Lakeland akác",2800,2070,18,"IGEN",-1,0,0,0,0,0,0,0,0,null,0,null,53699]
["H1284","EGGER H1284 fehér köris",2800,2070,18,"IGEN",0,0,0,0,0,0,0,0,0,null,0]
["H1298 dekor","EGGER Dekor H1298",2800,1310,1,"IGEN",0,0,0,0,0,0,0,0,0,null,0]
["H1298 ST22","EGGER H1298 Homok Kőris",2800,2070,18,"IGEN",0,0,0,0,0,0,0,0,0,null,0,null,53438]
["H1334 ST9","EGGER H1334 ST9 Vil ferrara t",2800,2070,18,"IGEN",0,0,0,0,0,0,0,0,0,null,0,null,53439]
["H1387 ST10","EGGER H1387 ST10 Denver Tölgy",2800,2070,18,"IGEN",-1,0,0,0,0,0,0,0,0,null,0,null,53562]
["H1394 ST9","EGGER H1394 ST9 Homoksárga Tölgy",2800,2070,18,"IGEN",0,0,0,0,0,0,0,0,0,null,0,null,53390]
["H1401st22","EGGER H1401 Cascina Fenyő",2800,2070,18,"IGEN",0,0,0,0,0,0,0,0,0,null,0]
["H1424 ST22","EGGER H1424 ST22 Woodline kré",2800,2070,18,"IGEN",0,0,0,0,0,0,0,0,0,null,0,null,53601]
["H1428 ST22","EGGER H1428 ST22 Woodline mok",2800,2070,18,"IGEN",0,0,0,0,0,0,0,0,0,null,0,null,53602]
["H1474 ST22","EGGER H1474 ST22 Avola Pinie Fehér",2800,2070,18,"IGEN",0,0,0,0,0,0,0,0,0,null,0,null,53528]
["H1476 ST22","EGGER H1476 ST22 Avolai pezsgő",2800,2070,18,"IGEN",0,0,0,0,0,0,0,0,0,null,0,null,53442]
["H1487 ST22","EGGER H1487 ST22 Bramberg Fenyő",2800,2070,18,"IGEN",0,0,0,0,0,0,0,0,0,null,0,null,53557]
["H1502 ST15","EGGER H1502 ST15 Éger",2800,2070,18,"IGEN",0,0,0,0,0,0,0,0,0,null,0,null,53402]
["H1511 ST15","EGGER H1511 ST15 Bavaria bükk",2800,2070,18,"IGEN",0,0,0,0,0,0,0,0,0,null,0,null,53403]
["H1518 ST15","EGGER H1518 ST15 Natúr bükk",2800,2070,18,"IGEN",0,0,0,0,0,0,0,0,0,null,0,null,53404]
["H1521 ST15","EGGER H1521 ST15 Méz juhar",2800,2070,18,"IGEN",0,0,0,0,0,0,0,0,0,null,0,null,53405]
["H1521 ST15 25","EGGER H1521 Méz juhar 25×2800×2070",2800,2070,25,"IGEN",0,0,0,0,0,0,0,0,0,null,0]
["H1555 ST15","EGGER H1555 ST15 Wenge",2800,2070,18,"IGEN",0,0,0,0,0,0,0,0,0,null,0,null,53406]
["H1582 ST15","EGGER H1582 ST15 Ellmau bükk",2800,2070,18,"IGEN",0,0,0,0,0,0,0,0,0,null,0,null,53428]
["H1586 ST15","EGGER H1586 ST15 Gőzölt Bükk",2800,2070,18,"IGEN",0,0,0,0,0,0,0,0,0,null,0,null,53429]
["H1599 ST15","EGGER H1599 ST15 Tiroli cs b",2800,2070,18,"IGEN",0,0,0,0,0,0,0,0,0,null,0,null,53407]
["H1636 ST12","EGGER H1636 ST12 Locarno Cseresznye",2800,2070,18,"IGEN",0,0,0,0,0,0,0,0,0,null,0,null,53636]
["H1698 ST15","EGGER H1698 ST15 Lombar csere",2800,2070,18,"IGEN",-8,0,0,0,0,0,0,0,0,null,0,null,53446]
["H1706 ST15","EGGER H1706 ST15 Cseresznye",2800,2070,18,"IGEN",0,0,0,0,0,0,0,0,0,null,0,null,53409]
["H1709 ST15","EGGER H1709 ST15 Francia Dió",2800,2070,18,"IGEN",0,0,0,0,0,0,0,0,0,null,0,null,53410]
["H1733 ST9","EGGER H1733 ST9 Majnau nyír",2800,2070,18,"IGEN",0,0,0,0,0,0,0,0,0,null,0,null,53411]
["H1887 ST9","EGGER H1887 ST9 Natur Juhar",2800,2070,18,"IGEN",0,0,0,0,0,0,0,0,0,null,0,null,53448]
["H1950 ST15","EGGER H1950 ST15 Calvados nat",2800,2070,18,"IGEN",0,0,0,0,0,0,0,0,0,null,0,null,53412]
["H1951 ST15","EGGER H1951 ST15 Calvados pác",2800,2070,18,"IGEN",0,0,0,0,0,0,0,0,0,null,0,null,53413]
["H3005 ST22","EGGER H3005 ST22 Zebrano bézs",2800,2070,18,"IGEN",0,0,0,0,0,0,0,0,0,null,0,null,53451]
["H3006 ST22","EGGER H3006 ST22 Zebrano Homo",2800,2070,18,"IGEN",0,0,0,0,0,0,0,0,0,null,0,null,53414]
["H3012 ST22","EGGER H3012 ST22 Cocobolo natur",2800,2070,18,"IGEN",0,0,0,0,0,0,0,0,0,null,0,null,53452]
["H3025 ST15","EGGER H3025 ST15  Makassar",2800,2070,18,"IGEN",0,0,0,0,0,0,0,0,0,null,0,null,53415]
["H3025 ST30","EGGER H3025 ST30 Magasfényű Makassar",2800,2070,18,"IGEN",0,0,0,0,0,0,0,0,0,null,0,null,53517]
["H3030 ST9","EGGER H3030 ST9 Cordoba oliva világos",2800,2070,18,"IGEN",0,0,0,0,0,0,0,0,0,null,0,null,53453]
["H3031 ST 9","EGGER H3031  ST9 sötét oliva",2800,2070,18,"IGEN",0,0,0,0,0,0,0,0,0,null,0,null,53518]
["H3070 ST22","EGGER H3070 ST 22 Natur Urban",2800,2070,18,"IGEN",0,0,0,0,0,0,0,0,0,null,0,null,53455]
["H3080 ST15","EGGER H3080 ST15 Sierra Mahag",2800,2070,18,"IGEN",0,0,0,0,0,0,0,0,0,null,0,null,53457]
["H3090 ST22","EGGER H3090 ST22 Shore Wood",2800,2070,18,"IGEN",0,0,0,0,0,0,0,0,0,null,0,null,53559]
["H3114 ST9","EGGER H3114 ST9 Tirani Körte",2800,2070,18,"IGEN",0,0,0,0,0,0,0,0,0,null,0]
["H3128 ST15","EGGER H3128 ST15 Marano natur",2800,2070,18,"IGEN",0,0,0,0,0,0,0,0,0,null,0,null,53416]
["H3129 ST9","EGGER H3129 ST9 Merano vörös",2800,2070,18,"IGEN",0,0,0,0,0,0,0,0,0,null,0,null,53463]
["H3133 ST12","EGGER H3133 ST12 Trüff. Davos tölgy",2800,2070,18,"IGEN",0,0,0,0,0,0,0,0,0,null,0,null,53734]
["H3133/36 ST12","EGGER H3133 Trüff. Davos tölgy",2800,2070,36,"IGEN",0,0,0,0,0,0,0,0,0,null,0]
["H3154 ST36","EGGER H3154 ST36 Sötétsz Tölgy",2800,2070,18,"IGEN",0,0,0,0,0,0,0,0,0,null,0]
["H3156 ST12","EGGER H3156 ST12 Szürke Corbridge tölgy",2800,2070,18,"IGEN",0,0,0,0,0,0,0,0,0,null,0,null,53656]
["H3171 ST12","EGGER H3171 ST12 Olajos Tölgy",2800,2070,18,"IGEN",0,0,0,0,0,0,0,0,0,null,0]
["H3303 ST10","EGGER H3303 ST10 Natur arlington tölgy",2800,2070,18,"IGEN",0,0,0,0,0,0,0,0,0,null,0,null,33464]
["H3304 ST9","EGGER H3304 ST9 Pác.Chat.tölg",2800,2070,18,"IGEN",-4,0,0,0,0,0,0,0,0,null,0,null,53465]
["H3304 ST9 25","EGGER H3304 ST9 Chateau tölgy",2800,2070,25,"IGEN",0,0,0,0,0,0,0,0,0,null,0,null,53700]
["H3306 ST9","EGGER H3306 ST9 Chateau tölgy",2800,2070,18,"IGEN",0,0,0,0,0,0,0,0,0,null,0,null,53625]
["H3309 ST28","EGGER H3309 ST28 Homok Gladstone Tölgy",2800,2070,18,"IGEN",0,0,0,0,0,0,0,0,0,null,0,null,53610]
["H3325 Dekor","Forgácslap Dekor H3325 ST28",2790,2060,1,"IGEN",0,0,0,0,0,0,0,0,0,null,0]
["H3325 ST28","EGGER H3325 ST28 Dohány Tölgy",2800,2070,18,"IGEN",-5,0,0,0,0,0,0,0,0,null,0,null,53529]
["H3331 ST10","EGGER H3331 ST10 Natur nebresca t.",2800,2070,18,"IGEN",-9,0,0,0,0,0,0,0,0,null,0,null,53466]
["H3332 ST10","EGGER H3332 ST10 Szürke Nebrasca",2800,2070,18,"IGEN",-3,0,0,0,0,0,0,0,0,null,0,null,53555]
["H3353 ST11","EGGER H3353 ST11 Cortina tölg",2800,2070,18,"IGEN",0,0,0,0,0,0,0,0,0,null,0,null,53467]
["H3362 ST9","EGGER H3362 ST9 H V Tölgy",2800,2070,18,"IGEN",0,0,0,0,0,0,0,0,0,null,0,null,53468]
["H3363 ST9","EGGER H3363 ST9 Antracit Tölgy",2800,2070,18,"IGEN",0,0,0,0,0,0,0,0,0,null,0]
["H3387 ST 11","EGGER H3387 ST11 Rusztikus tö",2800,2070,18,"IGEN",0,0,0,0,0,0,0,0,0,null,0,null,53469]
["H3389 ST24","EGGER H3389 ST24 Vil nat tölg",2800,2070,18,"IGEN",0,0,0,0,0,0,0,0,0,null,0,null,53470]
["H3395 ST12","EGGER H3395 ST12 Natur Corbridge tölgy",2800,2070,18,"IGEN",-15,0,0,0,0,0,0,0,0,null,0,null,53495]
["H3395/36","EGGER H3395 ST12 Natur Corbridge tolgy",2800,2070,36,"IGEN",0,0,0,0,0,0,0,0,0,null,0]
["H3398 ST12","EGGER H3398 ST12 Konyak Tölgy",2800,2070,18,"IGEN",0,0,0,0,0,0,0,0,0,null,0]
["H3399 ST11","EGGER H3393 ST11 Fekete Tölgy",2800,2070,18,"IGEN",0,0,0,0,0,0,0,0,0,null,0]
["H3400 ST22","EGGER H3400 ST22 Natur Fenyő",2800,2070,18,"IGEN",0,0,0,0,0,0,0,0,0,null,0,null,53472]
["H3410 ST22","EGGER H3410 ST22 Vörösfenyő",2800,2070,18,"IGEN",0,0,0,0,0,0,0,0,0,null,0,null,53473]
["H3430 ST22","EGGER H3430 ST22",2800,2070,18,"IGEN",0,0,0,0,0,0,0,0,0,null,0]
["H3433 ST22","EGGER H3433 ST22 Polár aland fenyő",2800,2070,18,"IGEN",0,0,0,0,0,0,0,0,0,null,0,null,53733]
["H3450 ST22","EGGER H3450 ST 22 Fehér Fleetwood",2800,2070,18,"IGEN",-4,0,0,0,0,0,0,0,0,null,0,null,53652]
["H3451 ST22","EGGER H3451 ST22 Pezsgő Fleetwood",2800,2070,18,"IGEN",-3,0,0,0,0,0,0,0,0,null,0,null,53651]
["H3453 ST22","EGGER H3453 ST22 Lávaszürke Fleetwood",2800,2070,18,"IGEN",-4,0,0,0,0,0,0,0,0,null,0,null,53604]
["H3700 ST10","EGGER H3700 ST10Natur Pacifik dió",2800,2070,18,"IGEN",0,0,0,0,0,0,0,0,0,null,0,null,53476]
["H3702 ST10","EGGER H3702 ST10 Dohány Dió",2800,2070,18,"IGEN",-4,0,0,0,0,0,0,0,0,null,0,null,53477]
["H3704 25","EGGER H3704 Aida dió",2800,2070,25,"IGEN",0,0,0,0,0,0,0,0,0,null,0]
["H3704 ST15","EGGER H3704 ST15 Dió dohány",2800,2070,18,"IGEN",-3,0,0,0,0,0,0,0,0,null,0,null,53417]
["H3730 ST10","EGGER H3730 ST10 Natúr Hyckory",2800,2070,18,"IGEN",0,0,0,0,0,0,0,0,0,null,0]
["H3734 ST9","EGGER 3734ST9 Dijon dió natur",2800,2070,18,"IGEN",0,0,0,0,0,0,0,0,0,null,0,null,53418]
["H3753 ST22","EGGER H3753 ST22",2800,2070,18,"IGEN",0,0,0,0,0,0,0,0,0,null,0,null,53479]
["H3758 ST9","EGGER H3758 ST9 Nyír",2800,2070,18,"IGEN",0,0,0,0,0,0,0,0,0,null,0]
["H3760 ST22","EGGER H3760 ST",2800,2070,18,"IGEN",0,0,0,0,0,0,0,0,0,null,0]
["H3760/25","EGGER H3760/25 ST22",2800,2070,25,"IGEN",0,0,0,0,0,0,0,0,0,null,0]
["H3766 ST22","EGGER H3766 ST22",2800,2070,18,"IGEN",0,0,0,0,0,0,0,0,0,null,0]
["H3766 ST22 25","EGGER H3766 ST",0,0,0,"NEM",0,0,0,0,0,0,0,0,0,null,0]
["H3766/25","EGGER H3766/25 ST22",2800,2070,25,"IGEN",0,0,0,0,0,0,0,0,0,null,0]
["H3773 ST9","EGGER H3773 ST9 Fehérített DIÓ",2800,2070,18,"IGEN",-5,0,0,0,0,0,0,0,0,null,0,null,53541]
["H3775 ST9","EGGER H3775 ST9  Toscana dió",2800,2070,18,"IGEN",0,0,0,0,0,0,0,0,0,null,0,null,53480]
["H3778 ST9","EGGER H3778 ST9 Karibi natrur dió",2800,2070,18,"IGEN",0,0,0,0,0,0,0,0,0,null,0,null,53481]
["H3840 ST9","EGGER H3840 ST9 Natur mandal juhar",2800,2070,18,"IGEN",-1,0,0,0,0,0,0,0,0,null,0,null,53482]
["HDF 541","HDF FALCO 541 Samoa sötét",2800,2070,3,"IGEN",-2,0,0,0,0,0,0,0,0,null,0]
["HDF 573","HDF FAL573 3mm",2800,2070,3,"IGEN",0,0,0,0,0,0,0,0,0,null,0]
["HDF Akac","HDF Akác 54781 ( H 1615 )",2800,2090,3,"IGEN",-1,0,0,0,0,0,0,0,0,null,0,null,57531]
["HDF Bukk","HDF Bükk 3mm",2800,2070,3,"IGEN",-1,0,0,0,0,0,0,0,0,null,0,null,57520]
["HDF Calvados","HDF Calvados 3mm",2800,2070,3,"IGEN",-1,0,0,0,0,0,0,0,0,null,0,null,57522]
["HDF Cseri","HDF Cseresznye 3mm",2800,2070,3,"IGEN",-1,0,0,0,0,0,0,0,0,null,0,null,57521]
["HDF Csoki buk","HDF Csoki bükk 3mm",2800,2070,3,"IGEN",0,0,0,0,0,0,0,0,0,null,0,null,57540]
["HDF Dio","57533 HDF Dió 3mm",2800,2070,18,"IGEN",-10,0,0,0,0,0,0,0,0,null,0]
["HDF Feher","57513 HDF  Feher 3mm",2850,2070,3,"NEM",-965,0,0,0,0,0,0,0,0,null,0,null,57513]
["HDF Fekete","HDf Fekete 3mm",2800,2070,3,"NEM",-2,0,0,0,0,0,0,0,0,null,0,null,57525]
["HDF Fenyo","HDF Fenyő 3mm",2800,2070,3,"IGEN",-3,0,0,0,0,0,0,0,0,null,0,null,57512]
["HDF H1006","HDF H1006 Cremona tölgy 3mm",2800,2070,3.2,"IGEN",0,0,0,0,0,0,0,0,0,null,0]
["HDF Juhar","HDF Juhar 3mm",2800,2070,3,"IGEN",-3,0,0,0,0,0,0,0,0,null,0,null,57523]
["HDF Libato","57527 HDF Libanoni tölgy",2800,2070,3,"IGEN",-1,0,0,0,0,0,0,0,0,null,0,null,57527]
["HDF Mahagoni","HDF Mahagóni 3mm",2800,2070,3,"IGEN",-4,0,0,0,0,0,0,0,0,null,0,null,57526]
["HDF Salma","57566 HDF FAL466 Sötét alma",2800,2070,18,"IGEN",0,0,0,0,0,0,0,0,0,null,0]
["HDF Sonoma","57732 HDF Sanoma tölgy",2800,2070,3,"IGEN",-5,0,0,0,0,0,0,0,0,null,0,null,57732]
["HDF Tolgy","HDF Tölgy 3mm",2850,2070,3,"IGEN",-3,0,0,0,0,0,0,0,0,null,0,null,57539]
["HDF Vil. bukk","HDF Vilagos bukk 3mm",2800,2070,3,"IGEN",0,0,0,0,0,0,0,0,0,null,0]
["HDF Wenge","HDF Wenge 3mm",2800,2070,3,"IGEN",-7,0,0,0,0,0,0,0,0,null,0,null,57532]
["HDF1394","HDF 1394 3mm",2800,2070,4,"IGEN",0,0,0,0,0,0,0,0,0,null,0]
["HDF1424","HDF H1424 Woodline krém 3mm",2800,2070,4,"IGEN",0,0,0,0,0,0,0,0,0,null,0]
["HDF3353","HDF H3353 3mm",2800,2070,3,"IGEN",0,0,0,0,0,0,0,0,0,null,0]
["HDF524","HDF FALCO524 érett tölgy 3mm",2800,2070,18,"IGEN",0,0,0,0,0,0,0,0,0,null,0]
["HDFCsokiTolgy","HDF  Ferrara Csoki Tolgy 3 mm",2800,2070,3,"IGEN",0,0,0,0,0,0,0,0,0,null,0]
["HDFD118","HDF Vanilia (D118)",2800,2070,0.4,"NEM",0,0,0,0,0,0,0,0,0,null,0]
["HDFFURTOLGY","HDF Tölgy  4mm",2500,1250,4,"IGEN",0,0,0,0,0,0,0,0,0,null,0]
["HDFKoris","HDF Niagara kőris",2800,2070,3,"IGEN",0,0,0,0,0,0,0,0,0,null,0]
["HDFNAT3","HDF Natúr 3mm",2745,1700,3,"NEM",0,0,0,0,0,0,0,0,0,null,0]
["HDFSZURKE","HDF Szürke 3mm",2850,2070,3,"NEM",-1,0,0,0,0,0,0,0,0,null,0,null,57529]
["K775 PR","KRONOWOOD 775 PR Redwood",2800,2070,18,"IGEN",0,0,0,0,0,0,0,0,0,null,0]
["KRO 101 PR 25","KRONOSPAN PR Prégelt fehér",2800,2070,25,"NEM",0,0,0,0,0,0,0,0,0,null,0]
["KRO344 PR","KRONOWOOD 344 PR Cseresznye",2800,2070,18,"IGEN",0,0,0,0,0,0,0,0,0,null,0]
["KRO375 PR","KRONOWOOD375 PR  Juhar",2800,2070,18,"IGEN",0,0,0,0,0,0,0,0,0,null,0]
["KRO381 PR","KRONOWOOD 381 PR Bükk",2800,2070,25,"IGEN",0,0,0,0,0,0,0,0,0,null,0]
["KRO522 PR","KRONOWOOD 522 PR Bézs",2800,2070,18,"NEM",0,0,0,0,0,0,0,0,0,null,0]
["KRO540 PE","KRONOWOOD 540 PE Manh. szürke",2800,2070,18,"NEM",0,0,0,0,0,0,0,0,0,null,0]
["KRO540 PE 25","KRONOWOOD 540 PE Manh. szürke",2800,2070,25,"NEM",0,0,0,0,0,0,0,0,0,null,0]
["KRO708 PR","KRONOWOOD D708 PR Pácolt tölg",2800,2070,18,"IGEN",0,0,0,0,0,0,0,0,0,null,0]
["KRO741","KRONOWOOD 741",2800,2070,18,"IGEN",0,0,0,0,0,0,0,0,0,null,0]
["KRO757","KRONOWOOD 757 Tölgy",2800,2070,18,"IGEN",0,0,0,0,0,0,0,0,0,null,0]
["KRO775","KRONOWOOD Redwood",2800,2070,18,"IGEN",0,0,0,0,0,0,0,0,0,null,0]
["KRO876 BS","KRONOSPAN  876 BS Bükk",2800,2070,18,"IGEN",0,0,0,0,0,0,0,0,0,null,0]
["KRO9569 PE"," KRONOSPAN 9569 PE Vanilia",2800,2070,18,"NEM",0,0,0,0,0,0,0,0,0,null,0]
["M271 FS70","Falco M271 FS70 Antracit Fényes",2800,2070,18,"NEM",0,0,0,0,0,0,0,0,0,null,0]
["MDF NAT8","57008  MDF Natur 8mm",2800,2070,8,"NEM",0,0,0,0,0,0,0,0,0,null,0]
["MDF NATMAR 18","57021 MDF Natúr Mélyen marható",2620,2070,18,"NEM",0,0,0,0,0,0,0,0,0,null,0]
["MDF1OLDFEHER","57118 MDF Egyoldalt laminált fehér",2800,2070,18,"NEM",0,0,0,0,0,0,0,0,0,null,0]
["MDFNAT12","57012 MDF Natur 12 mm",2800,2070,12,"NEM",0,0,0,0,0,0,0,0,0,null,0]
["NATforg 38","Forgácslap Natur 38mm",2800,2070,38,"NEM",0,0,0,0,0,0,0,0,0,null,0]
["Parketta","Parketta",1300,420,10,"NEM",0,0,0,0,0,0,0,0,0,null,0]
["Plexi","Plexi tábla",2050,1010,8,"NEM",0,0,0,0,0,0,0,0,0,null,0]
["Tolgy TM 20","Tölgy táblásított TM 2230x1060x20",2230,1060,20,"NEM",0,0,0,0,0,0,0,0,0,null,0]
["U104 ST15","EGGER U104 ST15 Alabástrom",2800,2070,18,"NEM",-3,0,0,0,0,0,0,0,0,null,0,null,53484]
["U107 ST8","EGGER U107  ST9 Bársony sárga",2800,2070,18,"NEM",0,0,0,0,0,0,0,0,0,null,0,null,53399]
["U108 ST15","EGGER U108 ST15 Vanilia",2800,2070,18,"NEM",-1,0,0,0,0,0,0,0,0,null,0,null,53485]
["U108 ST30","EGGER  U108 ST30 Vanilia Fényes",2800,2070,18,"NEM",0,0,0,0,0,0,0,0,0,null,0,null,53486]
["U113","EGGER U113 Gyöngyfehér",2800,2070,18,"NEM",-2,0,0,0,0,0,0,0,0,null,0,null,53487]
["U114 ST9","EGGER U114 ST9 Brillant sárga",2800,2070,18,"NEM",-1,0,0,0,0,0,0,0,0,null,0,null,56029]
["U116 ST15","EGGER U116 ST15 Jázmin",2800,2070,18,"NEM",0,0,0,0,0,0,0,0,0,null,0,null,53488]
["U156 ST9","EGGER U156 ST 9",2800,2070,18,"NEM",0,0,0,0,0,0,0,0,0,null,0,null,53491]
["U201 ST9","EGGER U201 ST9 Kavics Szürke",2800,2070,18,"NEM",0,0,0,0,0,0,0,0,0,null,0]
["U203 ST15","EGGER U203 ST 15 Karamell",2800,2070,18,"NEM",0,0,0,0,0,0,0,0,0,null,0,null,53603]
["U204 ST9","EGGER U204 ST9  Camel",2800,2070,18,"NEM",0,0,0,0,0,0,0,0,0,null,0,null,53389]
["U216 ST15","EGGER U216 ST15 Osztriga",2800,2070,18,"NEM",0,0,0,0,0,0,0,0,0,null,0,null,53494]
["U222 ST15","EGGER U222 ST15 Krém",2800,2070,18,"NEM",-4,0,0,0,0,0,0,0,0,null,0,null,53590]
["U224 ST15","EGGER U224 ST2 Bézs Selyem",2800,2070,18,"NEM",-5,0,0,0,0,0,0,0,0,null,0,null,53400]
["U311 ST15","EGGER U311 ST15 Bordó",2800,2070,18,"NEM",0,0,0,0,0,0,0,0,0,null,0,null,53496]
["U321 ST15","EGGER U321 ST15 Kínai vörös",2800,2070,18,"NEM",0,0,0,0,0,0,0,0,0,null,0,null,53592]
["U337 ST9","EGGER U337 ST9  Vöröses Lila",2800,2070,18,"NEM",0,0,0,0,0,0,0,0,0,null,0,null,53650]
["U363 ST9","EGGER U363 ST9 Flamingo",2800,2070,18,"NEM",-1,0,0,0,0,0,0,0,0,null,0,null,53563]
["U504 ST9","EGGER U504 Tiroli Kék",2800,2070,18,"NEM",0,0,0,0,0,0,0,0,0,null,0]
["U514 ST15","EGGER U514 Balti kék",2800,2070,18,"NEM",0,0,0,0,0,0,0,0,0,null,0,null,53503]
["U522 ST15","EGGER U522 Horizont kék",2800,2070,18,"NEM",0,0,0,0,0,0,0,0,0,null,0,null,53504]
["U525 ST9","EGGER U525 ST9 Delft Kék",2800,2070,18,"NEM",-1,0,0,0,0,0,0,0,0,null,0,null,53505]
["U532 ST15","EGGER U532 ST15 Petrol kék",2800,2070,18,"NEM",0,0,0,0,0,0,0,0,0,null,0,null,53388]
["U539 ST9","EGGER U539 ST9. Acél kék",2800,2070,18,"NEM",0,0,0,0,0,0,0,0,0,null,0,null,53539]
["U540 ST9","EGGER U540 Denim",2800,2070,18,"NEM",0,0,0,0,0,0,0,0,0,null,0,null,53540]
["U626 ST9","EGGER U626 ST9 Kiwi Zöld",2800,2070,18,"NEM",-5,0,0,0,0,0,0,0,0,null,0,null,53626]
["U630 ST15","EGGER U630 ST15 Élénk zöld",2800,2070,18,"NEM",-2,0,0,0,0,0,0,0,0,null,0,null,53634]
["U632 ST15","EGGER U632 ST15 Fű zöld",2800,2070,18,"NEM",0,0,0,0,0,0,0,0,0,null,0,null,53632]
["U633 ST15","EGGER U633 Türkisz",2800,2070,18,"NEM",0,0,0,0,0,0,0,0,0,null,0,null,53633]
["U702 ST16","EGGER U702 ST16 Kasmír Szürke",2800,2070,18,"NEM",0,0,0,0,0,0,0,0,0,null,0]
["U702 ST9","EGGER U702 ST9 Kasmír Szürke",2800,2070,18,"NEM",0,0,0,0,0,0,0,0,0,null,0]
["U707 ST9","EGGER U707 ST9 Selyem szürke",2800,2070,18,"NEM",0,0,0,0,0,0,0,0,0,null,0]
["U708 ST15","EGGER U708 ST15 Világos szürke",2800,2070,18,"NEM",0,0,0,0,0,0,0,0,0,null,0,null,53512]
["U727 ST9","EGGER U727 ST9 Kőszürke",2800,2070,18,"NEM",0,0,0,0,0,0,0,0,0,null,0,null,53527]
["U730 ST9","EGGER U730 ST9 Bazalt",2800,2070,18,"IGEN",0,0,0,0,0,0,0,0,0,null,0,null,53530]
["U732 ST15","EGGER U732 ST15 Porszürke",2800,2070,18,"NEM",0,0,0,0,0,0,0,0,0,null,0,null,53532]
["U750 ST9","EGGER U750 ST9 Világos szürke",2800,2070,18,"NEM",0,0,0,0,0,0,0,0,0,null,0,null,53753]
["U763 ST15","EGGER U763 ST15 Gyöngy szürke",2800,2070,18,"NEM",0,0,0,0,0,0,0,0,0,null,0,null,53531]
["U763 ST18","EGGER U763 ST18 Erezett hullám",2070,2800,18,"IGEN",0,0,0,0,0,0,0,0,0,null,0,null,53763]
["U767 ST9","EGGER U767 ST9 Cubanit szürke",2800,2070,18,"NEM",0,0,0,0,0,0,0,0,0,null,0,null,53567]
["U773 ST2","EGGER U773 ST2 Halvány szürke",2800,2070,18,"NEM",0,0,0,0,0,0,0,0,0,null,0]
["U775 ST15","EGGER U775 ST15 Fehéres szürk",2800,2070,18,"NEM",0,0,0,0,0,0,0,0,0,null,0,null,53534]
["U788 ST9","EGGER U788 ST9 Arctic szürke",2800,2070,18,"NEM",-5,0,0,0,0,0,0,0,0,null,0,null,56030]
["U961  ST2","EGGER U961 ST2  Grafit",2800,2070,18,"NEM",-9,0,0,0,0,0,0,0,0,null,0,null,53561]
["W1000 PM 25","EGGER W1000 PM Erezett fehér",2800,2070,18,"IGEN",0,0,0,0,0,0,0,0,0,null,0]
["W1000 ST30","EGGER W1000 ST30 Prémium fehé",2800,2070,18,"NEM",0,0,0,0,0,0,0,0,0,null,0,null,53533]
["W1000 ST9","EGGER W1000 ST9 pregelt feher",2800,2070,18,"NEM",-2,0,0,0,0,0,0,0,0,null,0,null,53523]
["W1000ST38","EGGER W1000ST38 Erezett Fehér",2800,2070,18,"IGEN",-2,0,0,0,0,0,0,0,0,null,0]
["W908 SM 10","EGGER W908 SM 10 korpuszfehér",2800,2070,10,"NEM",0,0,0,0,0,0,0,0,0,null,0]
["W908 SM 18","EGGER W908 SM 18 Korpuszfehér",2800,2070,18,"NEM",0,0,0,0,0,0,0,0,0,null,0,null,53401]
["W908 ST2","EGGER W908 ST2 18 Fehér prég",2800,2070,18,"NEM",0,0,0,0,0,0,0,0,0,null,0,null,53799]
["W980 ST2","EGGER W980 ST2 18 Platina",2800,2070,18,"IGEN",-7,0,0,0,0,0,0,0,0,null,0,null,53680]

{"sheet":"Élzárók","index":2,"n_rows":910,"n_cols":15,"rows_kept":910,"hidden":true}
["54990009 22x2","ABS5499009 22x2",2,0,0,0,0,0,0,0,0,0]
["5499009 22x04","ABS5499009 22x04",0.4,0,0,0,0,0,0,0,0,0]
["5499009 22x2","ABS5499009 22x2",2,0,0,0,0,0,0,0,0,0]
["5499010 22x04","ABS22x04",0.4,0,0,0,0,0,0,0,0,0]
["5499010 22x2","ABS22x2",2,0,0,0,0,0,0,0,0,0]
["5499011 22x2","ABS5499011 22x2",2,0,0,0,0,0,0,0,0,0]
["5499012 22x2","ABS5499012 22x2",2,0,0,0,0,0,0,0,0,0]
["5499014 22x2","ABS5499014 22x2",2,0,0,0,220,275,0,0,0,0]
["5499019 22x04","ABS 5499019 22x0,4",0.4,0,0,0,0,0,0,0,0,0]
["5499019 22x2","ABS 5499019 22x2 Verónai M.",2,0,0,0,0,0,0,0,0,0]
["5499031 22x2","ABS5499031 22x2",2,0,0,0,0,0,0,0,0,0]
["5499031 22×04","ABS5499031 22×0,4",0.4,0,0,0,0,0,0,0,0,0]
["5499032 04","ABS 5499032 0,4",0.4,0,0,0,0,0,0,0,0,0]
["5499032 22x2","ABS5499032 22x2",2,0,0,0,0,0,0,0,0,0]
["5499034 22x2","ABS 5499034 22x2",2,0,0,0,0,0,0,0,0,0]
["5499035 22x04","ABS5499035 22x0,4",0.4,0,0,0,0,0,0,0,0,0]
["5499035 22x2","ABS 5499035 22x2",0.4,0,0,0,0,0,0,0,0,0]
["ABAF238 22x2","ABS F238 22x2 Kastamonu",2,0,0,0,0,0,0,0,0,0]
["ABHU16012622x","ABSHU160126 22x2",2,0,0,0,0,0,0,0,0,0]
["ABS 106V 22/1","ABS 22/ 1 Fényes Zebráno",1,0,0,0,0,0,0,0,0,0]
["ABS 310 22×1","ABS F 310 Rozsda Kerámia HD 29310   22×1",2,0,0,0,0,0,0,0,0,0]
["ABS 353 22×2","ABS A353 22×2    HD 24354",2,0,0,0,0,0,0,0,0,0]
["ABS 3753 22x0","Élléc 42x2mm Tölgy",2,0,0,0,0,0,0,0,0,0]
["ABS 546045","ABS 546045  22×1 Magasfényű Antracit",1,0,0,0,0,0,0,0,0,0]
["ABS 546115","ABS 546115 Magasfényű Akác 22×1",1,0,0,0,0,0,0,0,0,0]
["ABS 546125","ABS 546125 Magasfényű Német Tölgy 22×1",1,0,0,0,0,0,0,0,0,0]
["ABS 8944 22×2","ABS KRONO 8944 22×2   HD 228944",2,0,0,0,0,0,0,0,0,0]
["ABS akác 22x2","ABS22x2",2,0,0,0,0,0,0,0,0,0]
["ABS F239 22×1","ABS F239  22×1 Beige Trend",1,0,0,0,0,0,0,0,0,0]
["ABS F854",null,0,0,0,0,0,0,0,0,0,0]
["ABS Hozott","Hozott élanyag",0,0,0,0,0,0,0,0,0,0]
["ABS HU15532","ABS HU 15532",1,0,0,0,0,0,0,0,0,0]
["ABS Ivory Oak","ABS 22x1 Shinnoky Ivory Oak",1,0,0,0,0,0,0,0,0,0]
["ABS S2020-Y","ABS 22x1,3mm S2020-Y 60 R",1,0,0,0,0,0,0,0,0,0]
["ABS01020 22x1","ABS01020 22x1",1,0,0,0,0,0,0,0,0,0]
["ABS0251L","ABS0251 L 22x1",1,0,0,0,0,0,0,0,0,0]
["ABS0287L","ABS0287L",1,0,0,0,0,0,0,0,0,0]
["ABS0291L 22x1","ABS0291 L 22x1",1,0,0,0,0,0,0,0,0,0]
["ABS0329L","ABS0329L NCSS1010-Y30R",1,0,0,0,0,0,0,0,0,0]
["ABS0330L22x1","ABS0330L 22x1mm",1,0,0,0,0,0,0,0,0,0]
["ABS0332L 22x1","ABS0332L 22x1",1,0,0,0,0,0,0,0,0,0]
["ABS0334 L","ABS0334L 22x1",1,0,0,0,0,0,0,0,0,0]
["ABS0339L 22x1","ABS0339L 22x1",1,0,0,0,0,0,0,0,0,0]
["ABS0340L 22x1","ABS0340L 22x1",1,0,0,0,0,0,0,0,0,0]
["ABS0341L","ABS0341L 22x1",1,0,0,0,0,0,0,0,0,0]
["ABS0794 22x2","ABS0794 22x2 Platina Bronz",2,0,0,0,0,0,0,0,0,0]
["ABS102 22x04","ABS102 22x04 14481",0.4,0,0,0,0,0,0,0,0,0]
["ABS102 22x2","ABS 22x2mm 14481",2,0,0,0,0,0,0,0,0,0]
["ABS104 22x2","ABS 22x2mm Alabástrom",2,0,0,0,0,0,0,0,0,0]
["ABS104 22×0,4","ABS U104 22×0,4",0.4,0,0,0,0,0,0,0,0,0]
["ABS107 22x2","ABS107 22x2 B",2,0,0,0,0,0,0,0,0,0]
["ABS1129 22x04","ABS1129 22x04 HD241129",0.4,0,0,0,0,0,0,0,0,0]
["ABS1129 22x2","ABS1129 22x2 HD241129",2,0,0,0,0,0,0,0,0,0]
["ABS113 22×0,4","ABS U113 Gyöngyfehér 22×0,4  HU12514",0.4,0,0,0,0,0,0,0,0,0]
["ABS113 22×2","ABS U113 Gyöngyfehér 22×2  HU12514",2,0,0,0,0,0,0,0,0,0]
["ABS1137 22x04","ABS 22x0,4mm",0.4,0,0,0,0,0,0,0,0,0]
["ABS1137 22x2","ABS 22x2mm",2,0,0,0,0,0,0,0,0,0]
["ABS1145 22x04","ABS1145 22x04 HD241145",0.4,0,0,0,0,0,0,0,0,0]
["ABS1145 22x2","ABS1145 22x2 HD241145",0,0,0,0,0,0,0,0,0,0]
["ABS1151 42x2","ABS1151 42x2 HD241151",2,0,0,0,0,0,0,0,0,0]
["ABS115122×0,4","ABS1151 22x0,4 HD241151",0.4,0,0,0,0,0,0,0,0,0]
["ABS116V 22x1","ABS116V 22x1",1,0,0,0,0,0,0,0,0,0]
["ABS118 22×2","ABS D118 22×2 HU12514",2,0,0,0,0,0,0,0,0,0]
["ABS122C22×0,4","ABS 122C 22×1 Kantenservice Beige",1,0,0,0,0,0,0,0,0,0]
["ABS122V","ABS122V RAL9001",1,0,0,0,0,0,0,0,0,0]
["ABS123 22x04","ABS 22x0,4mm Világos szürke",0,0,0,0,0,0,0,0,0,0]
["ABS123 22x2","ABS 22x2mm Világos szürke",2,0,0,0,0,0,0,0,0,0]
["ABS1232 22x2","ABS22x2mm EGGER Loire kőris",2,0,0,0,0,0,0,0,0,0]
["ABS124V 22x1","ABS124V 22x1",1,0,0,0,0,0,0,0,0,0]
["ABS124V 42x1","ABS124V 42x1",1,0,0,0,0,0,0,0,0,0]
["ABS126B 22x1","ABS126B 22x1 matt",1,0,0,0,0,0,0,0,0,0]
["ABS1277 22x04","ABS 22x0,4mm Lakeland akác",0.4,0,0,0,0,0,0,0,0,0]
["ABS1277 22x2","ABS 22x2mm Lakeland Akác",2,0,0,0,0,0,0,0,0,0]
["ABS1298 22x2","ABS1298 22x2",2,0,0,0,0,0,0,0,0,0]
["ABS131V 22x1","ABS131V 22x1",1,0,0,0,0,0,0,0,0,0]
["ABS131V 42x1","ABS131V 42x1mm",1,0,0,0,0,0,0,0,0,0]
["ABS1334 22x04","ABS 22x04mm Világos ferara tölgy",0,0,0,0,0,0,0,0,0,0]
["ABS1334 22x2","Éléc 22x2mm Világos ferrara tölg",2,0,0,0,0,0,0,0,0,0]
["ABS134 22x0,4","ABS D134 22x0,4 Zöld HU164177",0.4,0,0,0,0,0,0,0,0,0]
["ABS1394 22×2","ABS H1394 Homoksárga Tölgy 22×2",2,0,0,0,0,0,0,0,0,0]
["ABS139422×0,4","ABS H1394 Homoksárga Tölgy",0.4,0,0,0,0,0,0,0,0,0]
["ABS1424 22x2","ABS1428 22x2 553W",2,0,0,0,0,0,0,0,0,0]
["ABS1428 22x2","ABS 22x2mm HD291428",2,0,0,0,0,0,0,0,0,0]
["ABS145 22x04","ABS 22x0,4mm Bronz",0,0,0,0,0,0,0,0,0,0]
["ABS145 22x22","ABS 22x2mm Bronz",2,0,0,0,0,0,0,0,0,0]
["ABS147 22x2","ABS 22x2mm Bíbor",2,0,0,0,0,0,0,0,0,0]
["ABS1474 22x04","ABS H 1474 ST22 22x0,4",0.4,0,0,0,0,0,0,0,0,0]
["ABS1474 22x2","ABS H1474 ST22 22x2",2,0,0,0,0,0,0,0,0,0]
["ABS1476 22x04","ABS1476 22x0,4 HD251476",0.4,0,0,0,0,0,0,0,0,0]
["ABS1476 22x2","ABS1476 22x2 HU251476",2,0,0,0,0,0,0,0,0,0]
["ABS149 22x2","ABS149 315pvc",2,0,0,0,0,0,0,0,0,0]
["ABS1502 22x04","ABS 22x0,4mm Éger",0.4,0,0,0,0,0,0,0,0,0]
["ABS1502 22x2","ABS 22x2mm Éger",2,0,0,0,0,0,0,0,0,0]
["ABS1511 22x04","ABS 22x04mm Bavaria bükk",0,0,0,0,0,0,0,0,0,0]
["ABS1511 22x2","ABS 22x2mm EGGER Bavaria bükk",2,0,0,0,0,0,0,0,0,0,null,20130614151303,"Hranipex Kft"]
["ABS1518 22x04","ABS1518 22x04",0.4,0,0,0,0,0,0,0,0,0]
["ABS1518 22x2","ABS1518 22x2",2,0,0,0,0,0,0,0,0,0]
["ABS1521  28×2","ABS 28×2  Méz juhar",2,0,0,0,0,0,0,0,0,0]
["ABS1521 22x04","ABS 22x0,4mm Méz juhar",0,0,0,0,0,0,0,0,0,0]
["ABS1521 22x2","ABS 22x2mm Méz juhar",2,0,0,0,0,0,0,0,0,0,null,20130620120205]
["ABS1555 22x04","ABS1555 22x0,4mm Wenge",0.4,0,0,0,0,0,0,0,0,0]
["ABS1555 22x2","ABS 22x2mm Wenge EGGER",2,0,0,0,299.212,374.01,0,0,0,0,null,20130422105005,"Hranipex Kft"]
["ABS1582 22x04","ABS1582 22x04 HD211582",0.4,0,0,0,0,0,0,0,0,0]
["ABS1582 22x2","ABS1582 22x2",2,0,0,0,0,0,0,0,0,0]
["ABS1586 22x2","ABS1586 22x2 400W",2,0,0,0,0,0,0,0,0,0]
["ABS1599 22x04","ABS1599 22x0,4 Csoki bükk",0.4,0,0,0,0,0,0,0,0,0]
["ABS1599 22x2","ABS 22x2mm Csoki bükk EGGER",2,0,0,0,0,0,0,0,0,0]
["ABS1599 42x2","ABS 42x2mm Csoki bükk EGGER",2,0,0,0,0,0,0,0,0,0]
["ABS1663622x2","ABSHU16636 22x2",2,0,0,0,0,0,0,0,0,0]
["ABS1698 22x04","ABS1698 22x0,4mm",0.4,0,0,0,0,0,0,0,0,0]
["ABS1698 22x2","ABS1698 22x2mm",2,0,0,0,0,0,0,0,0,0]
["ABS1706 22x04","ABS1706 22x04  4175",0.4,0,0,0,0,0,0,0,0,0]
["ABS1706 22x2","ABS1706 22x2 4175",2,0,0,0,0,0,0,0,0,0]
["ABS1709 22x2","ABS22x2mm Francia dió EGGER",2,0,0,0,0,0,0,0,0,0]
["ABS1733 22x04","ABS 22x0,4mm Majnau nyír",0,0,0,0,0,0,0,0,0,0]
["ABS1733 22x2","ABS1733 22x2mm Majnau nyír",2,0,0,0,0,0,0,0,0,0]
["ABS188553","NCS S2020-Y 60R ABS188533",1,0,0,0,0,0,0,0,0,0]
["ABS1887 22x2m","ABS 22x2mm Natur juhar EGGER",2,0,0,0,0,0,0,0,0,0]
["ABS1950 22x2","ABS1950 22x2 587 W",2,0,0,0,0,0,0,0,0,0]
["ABS1951 22x04","ABS 22x0,4mm Calvados vörös",0,0,0,0,0,0,0,0,0,0]
["ABS1951 22x2","ABS 22x2mm Vörös Calvados EGGER",2,0,0,0,0,0,0,0,0,0,null,20130822095412]
["ABS212210","ABSHD212210 22x2mm",2,0,0,0,0,0,0,0,0,0]
["ABS215 22×2","ABS FALCO 215  Narancs 22×2  HU14132",2,0,0,0,0,0,0,0,0,0]
["ABS216 22x2","ABS U216 22x2",2,0,0,0,0,0,0,0,0,0]
["ABS216 22×0,4","ABS U216 22×0,4  HU12216",0.4,0,0,0,0,0,0,0,0,0]
["ABS222 22x2","ABS 22x2mm Krém",2,0,0,0,0,0,0,0,0,0]
["ABS2230W","ABS 2230W 22x1",1,0,0,0,0,0,0,0,0,0]
["ABS271 22x04","ABS Falco 271 FS02 22x0,4",0.4,0,0,0,0,0,0,0,0,0]
["ABS271 22x2","ABS Falco 271 FS02 22x2",2,0,0,0,0,0,0,0,0,0]
["ABS274 22x2","ABS274 22x2 HD29274",2,0,0,0,0,0,0,0,0,0]
["ABS275 22x2","ABS275 22x2 Beton HD29275",2,0,0,0,0,0,0,0,0,0]
["ABS2931222x04","ABSHD29312 22x04",0.4,0,0,0,0,0,0,0,0,0]
["ABS2931222x2","ABSHD29312gy 22x2",2,0,0,0,0,0,0,0,0,0]
["ABS3006 22x0,","ABS 22x0,4mm Zabrano Homok",0,0,0,0,0,0,0,0,0,0]
["ABS3006 22x2","ABS 22x2mm Zebrano Homok",2,0,0,0,0,0,0,0,0,0]
["ABS3012 22x04","ABS3012 2x0,4 102L",0.4,0,0,0,0,0,0,0,0,0]
["ABS3012 22x2","ABS3012 22x2 102L",2,0,0,0,0,0,0,0,0,0]
["ABS3025 22x2","ABS 22x2mm HD293025",2,0,0,0,0,0,0,0,0,0]
["ABS3025 22×1","ABS H3025 ST30  22×1  HD29449",1,0,0,0,0,0,0,0,0,0]
["ABS3025 45x2","ABS 45x2mm HD293025",2,0,0,0,0,0,0,0,0,0,null,20130422113007]
["ABS307 22x04","ABS307 22x04 HU11307",0.4,0,0,0,0,0,0,0,0,0]
["ABS3070 22×0,","ABS H3070 Natur Urbano 22×0,4  HD 293070",0.4,0,0,0,0,0,0,0,0,0]
["ABS3070 22×2","ABS H3070 Natur Urbano 22×2  HD 293070",2,0,0,0,0,0,0,0,0,0]
["ABS3080 22×0,","ABS3080 22x0,4",0.4,0,0,0,0,0,0,0,0,0]
["ABS3080 2x2","ABS 22x2mm Sierra mahagóni EGGER",2,0,0,0,0,0,0,0,0,0]
["ABS3090 22x2","ABS H3090 22x2",2,0,0,0,0,0,0,0,0,0]
["ABS3114 22x04","ABS3114 22x0,4",0.4,0,0,0,0,0,0,0,0,0]
["ABS3114 22x2","ABS3114 22x2",2,0,0,0,0,0,0,0,0,0]
["ABS3128 22x04","ABS3128 22x04 808D",0.4,0,0,0,0,0,0,0,0,0]
["ABS3128 22x2","ABS3128 22x2 808D",2,0,0,0,0,0,0,0,0,0]
["ABS3129 22×04","ABS 22x0,4mm  104E",0.4,0,0,0,0,0,0,0,0,0]
["ABS3129 22×2","ABS 22×2mm Merano Vörös EGGER",2,0,0,0,0,0,0,0,0,0]
["ABS314 22×0,4","ABS Falco 314  22×0,4  HD17671",0.4,0,0,0,0,0,0,0,0,0]
["ABS314 22×2","ABS Falco 314 22×2 HD17671",2,0,0,0,0,0,0,0,0,0]
["ABS3154 22x2","ABS H3154 22x2",2,0,0,0,0,0,0,0,0,0]
["ABS316D 22x1","ABS316D 22x1",1,0,0,0,0,0,0,0,0,0]
["ABS316F 22x2","ABS316F 22x1",1,0,0,0,0,0,0,0,0,0]
["ABS319G 22x1","ABS319G 22x1",1,0,0,0,0,0,0,0,0,0]
["ABS319H 22x1","ABS319H RAL7040",1,0,0,0,0,0,0,0,0,0]
["ABS322 E 22x1","ABS322 E 22x1mm",1,0,0,0,0,0,0,0,0,0]
["ABS322 G22x1","ABS322G 22x1",1,0,0,0,0,0,0,0,0,0]
["ABS322C 22x1","ABS322C 22x1mm",1,0,0,0,0,0,0,0,0,0]
["ABS322F 22x1","ABS322 F",1,0,0,0,0,0,0,0,0,0]
["ABS325D","ABS325D 22x1",1,0,0,0,0,0,0,0,0,0]
["ABS3304 22x04","ABS3304 22x04 HD243304",0.4,0,0,0,0,0,0,0,0,0]
["ABS3304 22x2","ABS3304 22x2 HD243304",2,0,0,0,0,0,0,0,0,0,null,20130822085606]
["ABS3304 28x2","ABS3304 28x2 HD243304",2,0,0,0,0,0,0,0,0,0]
["ABS3306 22x2","ABS 22x2 Cha antracid tölgy EGGER",2,0,0,0,0,0,0,0,0,0]
["ABS3306 22×04","ABS 22×0,4 Cha antracid tölgy EGGER",0.4,0,0,0,0,0,0,0,0,0]
["ABS330A 22x1","ABS330A 22x1",1,0,0,0,0,0,0,0,0,0]
["ABS3325 22x2","ABSH3325 ST28 Dohány Tölgy",2,0,0,0,0,0,0,0,0,0]
["ABS3353 22x04","ABS3353 22x04",0.4,0,0,0,0,0,0,0,0,0]
["ABS335322×2","ABS H3353 22×2  Cortina tölgy  HD243353",2,0,0,0,0,0,0,0,0,0]
["ABS3362 22x2","ABS 22x2mm H Vörös tölgy",2,0,0,0,0,0,0,0,0,0]
["ABS3363 22x2","ABS H3363 22x2 Antracit Tölgy",2,0,0,0,0,0,0,0,0,0]
["ABS3389 22x04","ABS 22x0,4mm Világos natur tölgy",0,0,0,0,0,0,0,0,0,0]
["ABS3389 22x2","ABS 22x2mm Világos Natur tölgy",2,0,0,0,0,0,0,0,0,0]
["ABS3395 22x2","ABS3395 22x2 HD243395",2,0,0,0,0,0,0,0,0,0]
["ABS3395 42x2","ABS3395 42x2 HD243395",2,0,0,0,0,0,0,0,0,0]
["ABS3398 22x04","ABSH3398 22x0,4",0.4,0,0,0,0,0,0,0,0,0]
["ABS3398 22x2","ABS H3398 22x2",2,0,0,0,0,0,0,0,0,0]
["ABS3400 22x04","ABS 22x0,4mm Natur fenyő",0.4,0,0,0,0,0,0,0,0,0]
["ABS3400 22x2","ABS 22x2mm Natur fenyő",2,0,0,0,0,0,0,0,0,0]
["ABS3410 22x2","ABS 22x2mm Vörösfenyő EGGER",2,0,0,0,0,0,0,0,0,0]
["ABS344 22x2","ABS 22x2mm Beige FALCO",2,0,0,0,0,0,0,0,0,0,null,20131129155804]
["ABS3450 22x2","ABS3450 22x2 HD294450",2,0,0,0,0,0,0,0,0,0]
["ABS347 22x0,4","ABS22x0,4mm Yvori",0.4,0,0,0,0,0,0,0,0,0]
["ABS347 22x2","ABS 22x2mm Ivory",2,0,0,0,0,0,0,0,0,0]
["ABS353 22x0,4","ABS 22x0,4 Teak",0.4,0,0,0,0,0,0,0,0,0]
["ABS353 22×2","ABS A353  22×2  Teak",2,0,0,0,0,0,0,0,0,0]
["ABS354 22×2","ABSA354 22×2  HD244272",2,0,0,0,0,0,0,0,0,0]
["ABS357 22x04","ABS357 22x04 HD251474",0.4,0,0,0,0,0,0,0,0,0]
["ABS357 22×2","ABS A357 22×2  HD 251474",2,0,0,0,0,0,0,0,0,0]
["ABS359 22x2","ABS 22x2mm Cseresznye",2,0,0,0,0,0,0,0,0,0]
["ABS359 22×0,4","ABS A359  22×0,4 Morello Cherry  HD28775",0.4,0,0,0,0,0,0,0,0,0]
["ABS3702 22x2","ABS H3702 22x2 Dohány Díó",2,0,0,0,0,0,0,0,0,0]
["ABS3704 22x04","ABS22x0,4mm Aida dió",0,0,0,0,0,0,0,0,0,0]
["ABS3704 22x2","ABS 22x2mm Aida dió",2,0,0,0,0,0,0,0,0,0,null,20130422121011]
["ABS3704 42x2",null,2,0,0,0,0,0,0,0,0,0,null,20130422121010]
["ABS370A 22x2","ABS370A 22x2",2,0,0,0,0,0,0,0,0,0]
["ABS370C","ABS370C 22x1",1,0,0,0,0,0,0,0,0,0]
["ABS3730 22x2","ABSH3730 22x2",2,0,0,0,0,0,0,0,0,0]
["ABS3734 22x0,","ABS 22x0,4mm Dió Dijon",0.4,0,0,0,0,0,0,0,0,0]
["ABS3734 22x2","ABS 22x2mm Dió dijon",2,0,0,0,0,0,0,0,0,0,null,20130422105006]
["ABS3753 22x04","ABS 22x0,4 3753",0.4,0,0,0,0,0,0,0,0,0]
["ABS3753 22x2","ABS 3753 22x2",2,0,0,0,0,0,0,0,0,0]
["ABS3773 0,4","ABS H3773 22x0,4 EGGER",0.4,0,0,0,0,0,0,0,0,0]
["ABS3773 22x2","ABS 3773 22x2 EGGER",2,0,0,0,0,0,0,0,0,0]
["ABS3775 22×2","ABS H3775  22×2  HD 283453",2,0,0,0,0,0,0,0,0,0]
["ABS3778 22x2","ABS3778 22x2 404B",2,0,0,0,0,0,0,0,0,0]
["ABS37782 22x2","ABS 22x2mm Makassar",2,0,0,0,0,0,0,0,0,0]
["ABS379 22x2","ABS A379 22x2mm Bambusz",2,0,0,0,0,0,0,0,0,0]
["ABS37965 42x2","ABS 42x2mm Szil",2,0,0,0,0,0,0,0,0,0,null,20130422130712]
["ABS381 22x04","ABS 22x0,4mm Bükk",0,0,0,0,0,0,0,0,0,0]
["ABS381 28x2","ABS 28x2mm Bükk",2,0,0,0,0,0,0,0,0,0]
["ABS391 22x04","ABS391 22x0,4",0.4,0,0,0,0,0,0,0,0,0]
["ABS391 22x2","ABS391 22x2",2,0,0,0,0,0,0,0,0,0]
["ABS394 22x2","ABS394 22x2",2,0,0,0,0,0,0,0,0,0]
["ABS395 22x04","ABS395 22x0,4 601L",0.4,0,0,0,0,0,0,0,0,0]
["ABS396 22x04","ABS396 22x04 HD242609",0.4,0,0,0,0,0,0,0,0,0]
["ABS396 22x2","ABS396 22x2 HD242609",2,0,0,0,0,0,0,0,0,0]
["ABS398 22x04","ABS398 22x04 1208A",0.4,0,0,0,0,0,0,0,0,0]
["ABS398 22x2","ABS398 22x2 1208A",2,0,0,0,0,0,0,0,0,0]
["ABS3D22x2","ABS 2×2 3D  82 AA",2,0,0,0,0,0,0,0,0,0]
["ABS400 22x2","ABS400 22x2 HD283005",2,0,0,0,0,0,0,0,0,0]
["ABS403 22x2","ABS 22x2mm Kaliforniai cser FALCO",2,0,0,0,0,0,0,0,0,0]
["ABS403 22×0,4","ABS403 22×0,4 Kalforniai Cseresznye",0.4,0,0,0,0,0,0,0,0,0]
["ABS404 22x0,4","ABS 22x0,4mm Cseresznye",0,0,0,0,0,0,0,0,0,0]
["ABS404 22x2","ABS 22x2mm Cseresznye FALCO",2,0,0,0,0,0,0,0,0,0]
["ABS410 22x04","ABS410 Fenyő",0.4,0,0,0,0,0,0,0,0,0]
["ABS410 22x2","ABS 22x2mm Bió fenyő FALCO",2,0,0,0,0,0,0,0,0,0,null,20130620115703]
["ABS411 22x04","ABSA411 22x04 HD241267",0.4,0,0,0,0,0,0,0,0,0]
["ABS411 22x2","ABSA411 22x2 HD241267",2,0,0,0,0,0,0,0,0,0]
["ABS414 22x2","ABS 22x2mm Antracit tölgy",2,0,0,0,0,0,0,0,0,0]
["ABS414 22×0,4","ABS A414 22×0,4 Antracit tölgy",0.4,0,0,0,0,0,0,0,0,0]
["ABS415 22x0,4","ABS415 22x0,4mm Tölgy HD243388",0.4,0,0,0,0,0,0,0,0,0]
["ABS415 22×2","ABS415   22×2 mm Tölgy HD243388",2,0,0,0,0,0,0,0,0,0]
["ABS416 22x04","ABS416 22x0,4",0.4,0,0,0,0,0,0,0,0,0]
["ABS416 22x2","ABS22x2",2,0,0,0,0,0,0,0,0,0]
["ABS417K22x1","ABS417K 22x1 matt",1,0,0,0,0,0,0,0,0,0]
["ABS418 22x04","ABS22x04 HD22855",0.4,0,0,0,0,0,0,0,0,0]
["ABS418 22x2","ABS418 22x2 HD22855",2,0,0,0,0,0,0,0,0,0]
["ABS419 22x0,4","ABS 22x0,4mm Világos fenyő",0,0,0,0,0,0,0,0,0,0]
["ABS419 22x2","ABS 22x2mm Világos fenyő FALCO",2,0,0,0,0,0,0,0,0,0]
["ABS419 22×2","ABS A419 22×2  1201K",2,0,0,0,0,0,0,0,0,0]
["ABS425 22x2","ABS 425 22x2 Bézs Len",2,0,0,0,0,0,0,0,0,0]
["ABS428 22x0,4","ABS 22x0,4mm Mahagóni vörös",0,0,0,0,0,0,0,0,0,0]
["ABS428 22x2","ABS 22x2mm Mahagóni vörös",2,0,0,0,0,0,0,0,0,0]
["ABS438 22x0,4","ABS 22x0,4mm Világos bükk",0,0,0,0,0,0,0,0,0,0]
["ABS438 22x2","ABS 22x2mm Világos bükk FALCO",2,0,0,0,0,0,0,0,0,0,null,20130822092108]
["ABS440 22x2","ABS440 22x2 412C",2,0,0,0,0,0,0,0,0,0]
["ABS440 22×0,4","ABS440 22×0,4 412C",0.4,0,0,0,0,0,0,0,0,0]
["ABS441 22x2","ABS441 22x2 HD240296",2,0,0,0,0,0,0,0,0,0]
["ABS444 22x2","ABS 22x2mm HD23444",2,0,0,0,0,0,0,0,0,0]
["ABS459 22x0,4","ABS 22x2mm HD288451 FALCO Dió Extra",0.4,0,0,0,0,0,0,0,0,0]
["ABS460D 22x2","ABS460D 22x2",2,0,0,0,0,0,0,0,0,0]
["ABS466 22x2","ABS466 22x2 HD22063",2,0,0,0,0,0,0,0,0,0]
["ABS468 22x0,4","ABS 22x0,4mm Olasz alma",0,0,0,0,0,0,0,0,0,0]
["ABS474 22x0,4","ABS 22x0,4mm Kaliforniai cseri",0,0,0,0,0,0,0,0,0,0]
["ABS474 22x2","ABS 22x2mm Sötét royal tölgy",2,0,0,0,0,0,0,0,0,0]
["ABS489 22x0,4","ABS 22x0,4mm Sötét cal F489 E1951",0,0,0,0,0,0,0,0,0,0]
["ABS501 22×0,4","ABSF501 22x0,4 HD29501",0.4,0,0,0,0,0,0,0,0,0]
["ABS508 22x2","ABS FALCO 508 22x2",2,0,0,0,0,0,0,0,0,0]
["ABS518 22x2","ABS FALCO 518 22x2",2,0,0,0,0,0,0,0,0,0]
["ABS521 22x2","ABS 22x2mm Milánó tölgy FALCO",2,0,0,0,0,0,0,0,0,0]
["ABS522 22x2","ABS522 22x2 HU12522",2,0,0,0,0,0,0,0,0,0]
["ABS524 22x04","ABS FALCO 524 22x0,4 Éret Tölgy",0.4,0,0,0,0,0,0,0,0,0]
["ABS524 22x2","ABS524 22x2 HD282227",2,0,0,0,0,0,0,0,0,0,null,20130822085104]
["ABS524 42x2","ABS 42x2mm Érett tölgy",2,0,0,0,0,0,0,0,0,0]
["ABS538 22x0,4","ABS FALCO 538 22x0.4 Fenyő",0.4,0,0,0,0,0,0,0,0,0]
["ABS538 22x2","ABS FALCO 538 Fenyő 22x2",2,0,0,0,0,0,0,0,0,0]
["ABS539 22×0,4","ABS FALCO 539 22×0,4",0.4,0,0,0,0,0,0,0,0,0]
["ABS539 22×2","ABS FALCO 539 22×2",2,0,0,0,0,0,0,0,0,0]
["ABS540 22x04","ABS 22x0,4mm Manhattan szürke",0,0,0,0,0,0,0,0,0,0]
["ABS540 22x2","ABS540 22×2 HD287457",2,0,0,0,0,0,0,0,0,0]
["ABS540 22×0,4","ABS540 22×0,4 HD287457",0.4,0,0,0,0,0,0,0,0,0]
["ABS540 28x2","ABS 28x2mm Manhattan szürke",2,0,0,0,0,0,0,0,0,0]
["ABS54010  04","ABS5499010 22x04",0.4,0,0,0,0,0,0,0,0,0]
["ABS5406 22x04","ABS5499006 22x04 HD253212",0.4,0,0,0,0,0,0,0,0,0]
["ABS5406 22x2","ABS5499006 22x2  HD253212",2,0,0,0,0,0,0,0,0,0]
["ABS541 22x2","ABS541 22x2 HD289757",2,0,0,0,0,0,0,0,0,0]
["ABS546107 221","ABS546107 22x1",1,0,0,0,0,0,0,0,0,0]
["ABS546113","ABS6113 22x1",1,0,0,0,0,0,0,0,0,0]
["ABS546172","ABS546172 Szikrázó Krém 22×1",1,0,0,0,0,0,0,0,0,0]
["ABS546186","ABS Gizir 6186   22×1",1,0,0,0,0,0,0,0,0,0]
["ABS546300","ABS Gizir 6300  HL10681 22×1",1,0,0,0,0,0,0,0,0,0]
["ABS546410","ABS546410 Metál fehér 22×1",1,0,0,0,0,0,0,0,0,0]
["ABS54704 22x2","ABS54704 22x2  4706pvc",2,0,0,0,0,0,0,0,0,0]
["ABS54704 42x2","ABS54704 42x2",2,0,0,0,0,0,0,0,0,0]
["ABS5470422x04","ABS54704 22x0,4 4706pvc",0.4,0,0,0,0,0,0,0,0,0]
["ABS54705 22x2","ABS54705 22x2 S9200 SE",2,0,0,0,0,0,0,0,0,0]
["ABS5470522x04","ABS54705 22x04 S9200 SE",0.4,0,0,0,0,0,0,0,0,0]
["ABS54706 22x2","ABS 54706 Vanillia 22x2",2,0,0,0,0,0,0,0,0,0]
["ABS5470622×04","ABS 54706 Vanilia 22×0,4",0.4,0,0,0,0,0,0,0,0,0]
["ABS5470722x04","ABS54707 22x0,4 HD22358",0.4,0,0,0,0,0,0,0,0,0]
["ABS5470722x2","ABS54707 22x2 HD22358",2,0,0,0,0,0,0,0,0,0]
["ABS54708 22x2","ABS54708 22x2 HD230685",2,0,0,0,0,0,0,0,0,0]
["ABS5470822x04","ABS54708 22x0,4 HD230685",0.4,0,0,0,0,0,0,0,0,0]
["ABS5471022x04","ABS54710 22x0,4 HD28722",0.4,0,0,0,0,0,0,0,0,0]
["ABS5471022x2","ABS54710 22x2 HD28722",2,0,0,0,0,0,0,0,0,0]
["ABS54711 2204","ABS54711 22x0,4 Olasz Dió",0.4,0,0,0,0,0,0,0,0,0]
["ABS54711 22x2","ABS54711 22x2 Olasz Dió",2,0,0,0,0,0,0,0,0,0]
["ABS54717 22x2","ABS54717 22x2 Tölgy",2,0,0,0,0,0,0,0,0,0]
["ABS54718 22x2","ABS54718 22x2 058V",2,0,0,0,0,0,0,0,0,0]
["ABS5471822x04","ABS54718 22x0,4 058V",0.4,0,0,0,0,0,0,0,0,0]
["ABS54719 2204","ABS 54719 22x0,4",0.4,0,0,0,0,0,0,0,0,0]
["ABS54719 22x2","ABS 54719 22x2",2,0,0,0,0,0,0,0,0,0]
["ABS54720 22x2","ABS54720 22x2 351W",2,0,0,0,0,0,0,0,0,0]
["ABS5472022x04","ABS54720 22x0,4 351w",0.4,0,0,0,0,0,0,0,0,0]
["ABS54721 22x2","ABS54721 22x2 98463",2,0,0,0,0,0,0,0,0,0]
["ABS54721 42x2","ABS54721 42x2",2,0,0,0,0,0,0,0,0,0]
["ABS5472122x04","ABS54721 22x04 98463",0.4,0,0,0,0,0,0,0,0,0]
["ABS54727 22x2","ABS54727 22x2 HD289614",2,0,0,0,0,0,0,0,0,0]
["ABS5472722x04","ABS54727 22x04 HD289614",0.4,0,0,0,0,0,0,0,0,0]
["ABS54728 22x2","ABS54728 22x2 HD289450",2,0,0,0,0,0,0,0,0,0]
["ABS5472822x04","ABS54728 22x04 HD289450",0.4,0,0,0,0,0,0,0,0,0]
["ABS54729 22x2"," ABS54729 22x2  4023 ABS",2,0,0,0,0,0,0,0,0,0]
["ABS54729 42x2","ABS54729 42x2",2,0,0,0,0,0,0,0,0,0]
["ABS5472922x04","ABS54729 22x0,4 4023 ABS",0.4,0,0,0,0,0,0,0,0,0]
["ABS54734 22x2","ABS54734 22x2 HD26375",2,0,0,0,0,0,0,0,0,0]
["ABS5473422x04","ABS54734 22x0,4 HD26375",0.4,0,0,0,0,0,0,0,0,0]
["ABS54740 22x2","ABS54740 22x2 HD282177",2,0,0,0,0,0,0,0,0,0]
["ABS54740 42x2","ABS54740 42x2",2,0,0,0,0,0,0,0,0,0]
["ABS5474022x04","ABS54740 22x0,4 HD282177",0.4,0,0,0,0,0,0,0,0,0]
["ABS54745 22x2","ABS54745 22x2 601pvc",2,0,0,0,0,0,0,0,0,0]
["ABS54745 42x2","ABS54745 42x2",2,0,0,0,0,0,0,0,0,0]
["ABS5474522x04","ABS54745 22x0,4 ABS31H",0.4,0,0,0,0,0,0,0,0,0]
["ABS54746 22x2","ABS54746 22x2 HD282177",2,0,0,0,0,0,0,0,0,0]
["ABS5474622x04","ABS54746 22x0,4 HD282177",0.4,0,0,0,0,0,0,0,0,0]
["ABS5475622x04","ABS54756 22x0,4",0.4,0,0,0,0,0,0,0,0,0]
["ABS5475622x2","ABS54756 22x2",2,0,0,0,0,0,0,0,0,0]
["ABS54757 22x2","ABS54757 22x2mm HD45314",2,0,0,0,0,0,0,0,0,0]
["ABS5475722x04","ABS54757 22x0,4 HD45314",0.4,0,0,0,0,0,0,0,0,0]
["ABS54762 22x2","ABS 54762 22x2",2,0,0,0,0,0,0,0,0,0]
["ABS5476222×04","ABS54762 22×0,4 HD293048",0.4,0,0,0,0,0,0,0,0,0]
["ABS54780 22x2","ABS54780 22x2 HD242609",2,0,0,0,0,0,0,0,0,0]
["ABS54780 42x2","ABS54780 42x2",2,0,0,0,0,0,0,0,0,0]
["ABS5478022x04","ABS54780 22x04 HD242609",0.4,0,0,0,0,0,0,0,0,0]
["ABS54781 22x2","ABS54781 22x2 HD221615",2,0,0,0,0,0,0,0,0,0]
["ABS5478122x04","ABS54781 22x04 HD221615",0.4,0,0,0,0,0,0,0,0,0]
["ABS54788 22x2","ABS 54788 22x2 Világos Vadkörte",2,0,0,0,0,0,0,0,0,0]
["ABS5478822x04","ABS54788 22x04 Világos Vadkörte",0.4,0,0,0,0,0,0,0,0,0]
["ABS54789 22x2","ABS54789 22x2 058abs",2,0,0,0,0,0,0,0,0,0]
["ABS5478922x04","ABS54789 22x0,4 058v abs",0.4,0,0,0,0,0,0,0,0,0]
["ABS54794 22x2","ABS54794 22x2",2,0,0,0,0,0,0,0,0,0]
["ABS5479422x04","ABS54794 22x04",0.4,0,0,0,0,0,0,0,0,0]
["ABS54812 22x1","ABS 54812 22x1 Narancs",1,0,0,0,0,0,0,0,0,0]
["ABS54812 22x2","ABS54812 22x2",2,0,0,0,0,0,0,0,0,0]
["ABS54817 22x1","ABS 54817 22x1 Sárga",1,0,0,0,0,0,0,0,0,0]
["ABS54818 22×2","ABS54818 22×2 Zöld Bársony  HU16634",2,0,0,0,0,0,0,0,0,0]
["ABS54818 42×2","ABS54818 42×2  Zöld Bársony HU16634",2,0,0,0,0,0,0,0,0,0]
["ABS5481822×04","ABS54818  22×0,4 Zöld Bársony HU16634",0.4,0,0,0,0,0,0,0,0,0]
["ABS54828 22x2","ABS54828 22x2 Sötétkék",2,0,0,0,0,0,0,0,0,0]
["ABS5490022x04","ABS54900 22x0,4 HD253194",0.4,0,0,0,0,0,0,0,0,0]
["ABS5490022x2","ABS54900 22x2 HD253194",2,0,0,0,0,0,0,0,0,0]
["ABS54901 22x2","ABS54901 22x2 HD244303",2,0,0,0,0,0,0,0,0,0]
["ABS5490122×04","ABS 54901 22×0,4  HD 244303",0.4,0,0,0,0,0,0,0,0,0]
["ABS54903 22x2","ABS54903 22x2 HD251476",2,0,0,0,0,0,0,0,0,0]
["ABS5490322x04","ABS54903 22x04 HD251476",0.4,0,0,0,0,0,0,0,0,0]
["ABS54905 2204","ABS54905 22x04",0.4,0,0,0,0,0,0,0,0,0]
["ABS54905 22x2","ABS54905 22x2 Akác",2,0,0,0,0,0,0,0,0,0]
["ABS54908 22x2","ABS54908 22x2 5792",2,0,0,0,0,0,0,0,0,0]
["ABS54908 42x2","ABS54908 42x2",2,0,0,0,0,0,0,0,0,0]
["ABS5490822x08","ABS54908 22x04 5792",0.8,0,0,0,0,0,0,0,0,0]
["ABS54915 22x2","ABS54915 22x2 HD293143",2,0,0,0,0,0,0,0,0,0]
["ABS5491522x04","ABS54915 22x04 HD293143",0.4,0,0,0,0,0,0,0,0,0]
["ABS54916 22×2","ABS 54916 22×2 Cabo Verde  HD 283058",2,0,0,0,0,0,0,0,0,0]
["ABS5491622×04","ABS 54916 22×0,45 Cabo Verde HD 283058",0.45,0,0,0,0,0,0,0,0,0]
["ABS54919 22x2","ABS54919 22x2 564W",2,0,0,0,0,0,0,0,0,0]
["ABS54919 42x2","ABS54919 42x2",2,0,0,0,0,0,0,0,0,0]
["ABS5491922x04","ABS54919 22x0,4 564W",0.4,0,0,0,0,0,0,0,0,0]
["ABS54920 22x2","ABS54920 22x2 HD241146",2,0,0,0,0,0,0,0,0,0]
["ABS5492022x04","ABS54920 22x04 HD241146",0.4,0,0,0,0,0,0,0,0,0]
["ABS54921 22x2","ABS54921 22x2",2,0,0,0,0,0,0,0,0,0]
["ABS54921 42x2","ABS54921 42x2",2,0,0,0,0,0,0,0,0,0]
["ABS5492122x04","ABS54921 22x04",0.4,0,0,0,0,0,0,0,0,0]
["ABS54922 2204","ABS 54922 22x0,4",0.4,0,0,0,0,0,0,0,0,0]
["ABS54922 22x2","ABS 54922 22x2",2,0,0,0,0,0,0,0,0,0]
["ABS54928 22x2","ABS54928 22x2 HD241377",2,0,0,0,0,0,0,0,0,0]
["ABS5492822x04","ABS54928 22x04 HD241377",0.4,0,0,0,0,0,0,0,0,0]
["ABS54933 22x2","ABS54933 22x2 HD283713",2,0,0,0,0,0,0,0,0,0]
["ABS5493322x04","ABS54933 22x04 HD283713",0.4,0,0,0,0,0,0,0,0,0]
["ABS54934 22x2","ABS54934 22x2 HD273223",2,0,0,0,0,0,0,0,0,0]
["ABS5493422x04","ABS54934 22x04 HD273223",0.4,0,0,0,0,0,0,0,0,0]
["ABS54944 22x2","ABS54944 22x2",2,0,0,0,0,0,0,0,0,0]
["ABS5494422x04","ABS54944 22x04",0.4,0,0,0,0,0,0,0,0,0]
["ABS54952 22x2","ABS54952  22x2 1692W",2,0,0,0,0,0,0,0,0,0]
["ABS5495222x04","ABS54952 22x04 1692W",0.4,0,0,0,0,0,0,0,0,0]
["ABS549540","Gizir Fényes fekete 22x1",1,0,0,0,0,0,0,0,0,0]
["ABS5496222x1","ABS 54962 22x1 (726E)",1,0,0,0,0,0,0,0,0,0]
["ABS5496222x2","ABS54962 22x2 (726E)",2,0,0,0,0,0,0,0,0,0]
["ABS5496422x1","ABS 54964 22x1 (437A)",1,0,0,0,0,0,0,0,0,0]
["ABS5496422x2","ABS54964 22x2",2,0,0,0,0,0,0,0,0,0]
["ABS54980 22×2","ABS54980 22×2 Tahoe Tölgy  HD24003",2,0,0,0,0,0,0,0,0,0]
["ABS5498022×04","ABS54980 22×0,4 Tahoe tölgy HD24003",0.4,0,0,0,0,0,0,0,0,0]
["ABS5499001 04","ABS5499001 22x04 HD244139",0.4,0,0,0,0,0,0,0,0,0]
["ABS5499001 2","ABS5499001 22x2 HD244139",2,0,0,0,0,0,0,0,0,0]
["ABS5499006","ABS 5499006 22x0,4",0.4,0,0,0,0,0,0,0,0,0]
["ABS5499006 2","ABS5499006 22x2",2,0,0,0,0,0,0,0,0,0]
["ABS5499011 04","ABS 5499011 22x0,4",0.4,0,0,0,0,0,0,0,0,0]
["ABS5499014 2","ABS 5499014 22x2 Tejeskávé",2,0,0,0,0,0,0,0,0,0]
["ABS549901404","ABS5499014 22x0,4 Tejeskávé",0.4,0,0,0,0,0,0,0,0,0]
["ABS5499022  2","ABS 5499022 22x2",2,0,0,0,0,0,0,0,0,0]
["ABS5499022 04","ABS5499022 04 Skandináv Bükk",0.4,0,0,0,0,0,0,0,0,0]
["ABS5499026","ABS 5499026 22x2",2,0,0,0,0,0,0,0,0,0]
["ABS5499026 04","ABS 5499026 22x0,4",0.4,0,0,0,0,0,0,0,0,0]
["ABS5499027 04","ABS5499027 22x04 HD286094",4,0,0,0,0,0,0,0,0,0]
["ABS5499027 2","ABS5499027 22x2 HD286094",2,0,0,0,0,0,0,0,0,0]
["ABS5499034 ×1","ABS5499034 Fjordland 22×1 HD262284",1,0,0,0,0,0,0,0,0,0]
["ABS54992 22x2","ABS54992 22x2 HD241145",2,0,0,0,0,0,0,0,0,0]
["ABS54992 42x2","ABS54992 42x2",2,0,0,0,0,0,0,0,0,0]
["ABS5499222x04","ABS54992 22x0,4 HD241145",0.4,0,0,0,0,0,0,0,0,0]
["ABS54993 2204","ABS54993 22x0,4",0.4,0,0,0,0,0,0,0,0,0]
["ABS54993 22x2","ABS 54993 calvados 22x2",2,0,0,0,0,0,0,0,0,0]
["ABS54S036","ABS54S036 22x1 Matt Szürke",1,0,0,0,0,0,0,0,0,0]
["ABS570 22×2","ABS F570  22×2  Déli Kőris HD241777",2,0,0,0,0,0,0,0,0,0]
["ABS572 22x2","ABS 22x2mm Coimbra",2,0,0,0,0,0,0,0,0,0,null,20130822081903]
["ABS573 22x2","ABS573 22x2 HD24053",2,0,0,0,0,0,0,0,0,0]
["ABS577 22x04","ABS57722x0,4mm",0.4,0,0,0,0,0,0,0,0,0]
["ABS577 22x2","ABS577 22x2mm",2,0,0,0,0,0,0,0,0,0]
["ABS578 22x04","ABS578 22x0,4mm",0.4,0,0,0,0,0,0,0,0,0]
["ABS578 22x2","ABS578 22x2mm",2,0,0,0,0,0,0,0,0,0]
["ABS582 22x2","ABS582 22x2",2,0,0,0,0,0,0,0,0,0]
["ABS583 22x04","ABS 22x0,4mm Spanyol tölgy",0.4,0,0,0,0,0,0,0,0,0]
["ABS583 22x2","ABS 22x2mm Spanyol tölgy",2,0,0,0,0,0,0,0,0,0]
["ABS583 42x2","ABS 42x2mm Spanyol tölgy",2,0,0,0,0,0,0,0,0,0]
["ABS586 22×0,4","ABS FALCO 586 22×0,4",0.4,0,0,0,0,0,0,0,0,0]
["ABS587E","Metál ezüst ABS587E",1,0,0,0,0,0,0,0,0,0]
["ABS600 22x1","ABS 22x1mm HD288448",1,0,0,0,0,0,0,0,0,0]
["ABS6015 22x1","ABS 546015 22x1 Gizir",1,0,0,0,0,0,0,0,0,0]
["ABS602 22×2","ABS 22×2 Falco 602 HD 282715",2,0,0,0,0,0,0,0,0,0]
["ABS6020 22x1","ABS 6020 22x1 Gizir Krém",1,0,0,0,0,0,0,0,0,0]
["ABS6025 22x1","ABS 6025 22x1 Gizir Cappuccino",1,0,0,0,0,0,0,0,0,0]
["ABS6027 22x1","ABS6027 22x1",1,0,0,0,0,0,0,0,0,0]
["ABS6030 22x1","ABS6030 22x1",1,0,0,0,0,0,0,0,0,0]
["ABS6035 22×1","ABS546035 Magasfényű szürke 22×1",1,0,0,0,0,0,0,0,0,0]
["ABS604 22×2","ABS Falco 604  22×2  HD 283058",2,0,0,0,0,0,0,0,0,0]
["ABS6045","ABS6045 22x1 ANTRACIT",1,0,0,0,0,0,0,0,0,0]
["ABS605 22x04","ABS605 22x0,4mm",0.4,0,0,0,0,0,0,0,0,0]
["ABS605 22×2"," ABS 22×2  F605  HD28605",2,0,0,0,0,0,0,0,0,0]
["ABS6060 22×1","ABS 546060  Zöld  22×1",1,0,0,0,0,0,0,0,0,0]
["ABS6070 22x1","ABS6070 22x1 HU15141",1,0,0,0,0,0,0,0,0,0]
["ABS6080 22x1","ABS 6080 Bordó",1,0,0,0,0,0,0,0,0,0]
["ABS6100 22x1","ABS 6100 22x1 Zebránó",1,0,0,0,0,0,0,0,0,0]
["ABS6103 22x1","ABS 6103 22x1",1,0,0,0,0,0,0,0,0,0]
["ABS6105 22×1","ABS 6105 Terra Kávé 22×1",1,0,0,0,0,0,0,0,0,0]
["ABS6106 22x1","ABS 6106 22x1",1,0,0,0,0,0,0,0,0,0]
["ABS6107 22x1","ABS 6107 22x1",1,0,0,0,0,0,0,0,0,0]
["ABS6108 22x1","ABS 6108 22x1",1,0,0,0,0,0,0,0,0,0]
["ABS6109 22x1","ABS GIZIR 6109 22x1",1,0,0,0,0,0,0,0,0,0]
["ABS6112 22x1","ABS 6112 22x1",1,0,0,0,0,0,0,0,0,0]
["ABS6114 22x1","ABS 6114 22x1",1,0,0,0,0,0,0,0,0,0]
["ABS6115 22x04","ABS6115 22x04 akac matt",0.4,0,0,0,0,0,0,0,0,0]
["ABS6115 22x1","ABS6115 22x1",1,0,0,0,0,0,0,0,0,0]
["ABS6130 22x1","ABS6130 22x1",1,0,0,0,0,0,0,0,0,0]
["ABS6135 22x1","ABS6135 22x1",1,0,0,0,0,0,0,0,0,0]
["ABS614 42x2","ABS 42x2mm Lyon dió",2,0,0,0,0,0,0,0,0,0]
["ABS6158 22×1","ABS 546158 Magasfényű gyöngyfehér",1,0,0,0,0,0,0,0,0,0]
["ABS6170 22x1","ABS 6170 22x1 ALU",1,0,0,0,0,0,0,0,0,0]
["ABS6177 22x1","ABS6177 22x1",1,0,0,0,0,0,0,0,0,0]
["ABS6180 22x1","GIZIR 6180 22x1",1,0,0,0,0,0,0,0,0,0]
["ABS6181 22x1","GIZIR 6181 22x1",1,0,0,0,0,0,0,0,0,0]
["ABS6183 22x1","GIZIR 6183 22x1",1,0,0,0,0,0,0,0,0,0]
["ABS6185 22×1","ABS 546185 Magasfényű cappuccino",1,0,0,0,0,0,0,0,0,0]
["ABS6186 22x1","ABS GIZIR 6186 22x1",1,0,0,0,0,0,0,0,0,0]
["ABS6187","ABS 6187 22x1",1,0,0,0,0,0,0,0,0,0]
["ABS6193 22x1","ABS6193 22x1 Arany Háló",1,0,0,0,0,0,0,0,0,0]
["ABS6195 22x1","ABS6195 22x1 Kenya Silver",1,0,0,0,0,0,0,0,0,0]
["ABS6196 22x1","ABS 6196 22x1 Crokodil",1,0,0,0,0,0,0,0,0,0]
["ABS6198 22x1","ABS 6198 22x1",1,0,0,0,0,0,0,0,0,0]
["ABS6200 22x1","ABS GIZIR 6200 22x1",1,0,0,0,0,0,0,0,0,0]
["ABS6220 22x1","ABS 6220 22x1",1,0,0,0,0,0,0,0,0,0]
["ABS62414","MIL022 ABS62414",1,0,0,0,0,0,0,0,0,0]
["ABS62414.","MIL030 ABS62414",1,0,0,0,0,0,0,0,0,0]
["ABS62524","RAL3001 ABS62524",1,0,0,0,0,0,0,0,0,0]
["ABS625A","ABS 625A Kanten 22×0,4",0.4,0,0,0,0,0,0,0,0,0]
["ABS6290 22x1","ABS 629022x1 Szikrázó barna",1,0,0,0,0,0,0,0,0,0]
["ABS62902","RAL3009 ABS62902",1,0,0,0,0,0,0,0,0,0]
["ABS62936","RAL3003 ABS62936",1,0,0,0,0,0,0,0,0,0]
["ABS633 22x1","ABS633 22x1",1,0,0,0,0,0,0,0,0,0]
["ABS64083R","RAL1013 ABS64083",1,0,0,0,0,0,0,0,0,0]
["ABS6410 22x1","Gizir 6410 22x1",1,0,0,0,0,0,0,0,0,0]
["ABS6435 22x1","ABS6435 22x1",1,0,0,0,0,0,0,0,0,0]
["ABS658 22x2","ABS658 22x2 HD267731",2,0,0,0,0,0,0,0,0,0]
["ABS67302","NCS S1002-R-50 B ABS67302",1,0,0,0,0,0,0,0,0,0]
["ABS697 22x0,4","ABS Falco 697 22x0,4",0.4,0,0,0,0,0,0,0,0,0]
["ABS697 22×2","ABS Falco 697 Világos Szil 22×2",2,0,0,0,0,0,0,0,0,0]
["ABS698 22×2","ABS Falco 698 Sötét Szil  22×2",2,0,0,0,0,0,0,0,0,0]
["ABS703 22x04","ABS54703 22x0.4 ABS24",0.4,0,0,0,34,42.5,0,0,0,0]
["ABS703 22x1","ABS54703 22x1 ABS24",1,0,0,0,0,0,0,0,0,0]
["ABS703 22x2","ABS54703 22x2 ABS24",2,0,0,0,113,141.25,0,0,0,0]
["ABS703 22x2ER","ABS54703ER 22x2 erezett",2,0,0,0,0,0,0,0,0,0]
["ABS703 22x2PR","ABS54703PRE 22x2 pregelt",2,0,0,0,0,0,0,0,0,0]
["ABS703 42x2","ABS54703 42x2mm ABS24V",2,0,0,0,0,0,0,0,0,0]
["ABS70322x04ER","ABD54703ER 22x04 erezett",0.4,0,0,0,0,0,0,0,0,0]
["ABS70322x04PR","ABS54703 22x04 pregelt",0.4,0,0,0,0,0,0,0,0,0]
["ABS708 22x2","ABS 22x2mm Pácolt tölgy",2,0,0,0,0,0,0,0,0,0]
["ABS7081 22x1","ABS 7081 22x1",1,0,0,0,0,0,0,0,0,0]
["ABS7087 22x1","ABS7087 22x1",1,0,0,0,0,0,0,0,0,0]
["ABS71038","RAL8019 ABS71038",1,0,0,0,0,0,0,0,0,0]
["ABS722 C","ABS722 C 22x1mm",1,0,0,0,0,0,0,0,0,0]
["ABS722D 22x1","ABS722D 22x1",1,0,0,0,0,0,0,0,0,0]
["ABS72467 22x1","ABS72467 Szürke",1,0,0,0,0,0,0,0,0,0]
["ABS72885","RAL9001 ABS72885",1,0,0,0,0,0,0,0,0,0]
["ABS72885.","MIL008 ABS72885",2,0,0,0,0,0,0,0,0,0]
["ABS72885..","MIL029 ABS72885",1,0,0,0,0,0,0,0,0,0]
["ABS741 22x2","ABS741 HD24741",2,0,0,0,0,0,0,0,0,0]
["ABS757 22x04","ABS757 HD24327",0.4,0,0,0,0,0,0,0,0,0]
["ABS76173","KMT983/20 ABS76173",1,0,0,0,0,0,0,0,0,0]
["ABS76173.","MIL029 ABS76173",1,0,0,0,0,0,0,0,0,0]
["ABS76173..","MIL008 ABS76173",1,0,0,0,0,0,0,0,0,0]
["ABS76173...","NCS 1005Y 60R ABS76173",1,0,0,0,0,0,0,0,0,0]
["ABS76173.....","RAL9001 ABS76173",1,0,0,0,0,0,0,0,0,0]
["ABS76264","RAL9003 ABS76264",1,0,0,0,0,0,0,0,0,0]
["ABS76264.","NCS S3020-R80B",1,0,0,0,0,0,0,0,0,0]
["ABS76264..","MIL602 ABS76264",1,0,0,0,0,0,0,0,0,0]
["ABS76264...","RAL4008 ABS76264",1,0,0,0,0,0,0,0,0,0]
["ABS76264R","RAL9003 ABS76264",1,0,0,0,0,0,0,0,0,0]
["ABS76474R","RAL3004 ABS76474",1,0,0,0,0,0,0,0,0,0]
["ABS76490","RAL9005 ABS76490",1,0,0,0,0,0,0,0,0,0]
["ABS76490.","RAL4008 ABS76490",1,0,0,0,0,0,0,0,0,0]
["ABS76557","RAL9010 ABS76557",1,0,0,0,0,0,0,0,0,0]
["ABS76564","RAL2009 ABS76564",1,0,0,0,0,0,0,0,0,0]
["ABS77024","RAL4007 ABS77024",1,0,0,0,0,0,0,0,0,0]
["ABS77065 22x1","ABS77065 22x1mm RAL5023",1,0,0,0,0,0,0,0,0,0]
["ABS77082","RAL1014 ABS77082",1,0,0,0,0,0,0,0,0,0]
["ABS77204 22x1","ABS77204 22x1 RAL7046",1,0,0,0,0,0,0,0,0,0]
["ABS77284","RAL8017 ABS77284",1,0,0,0,0,0,0,0,0,0]
["ABS77284R.","S8010-Y50R ABS77284",1,0,0,0,0,0,0,0,0,0]
["ABS77346","S1005-Y40R ABS77346",1,0,0,0,0,0,0,0,0,0]
["ABS77346 22x1","ABS77346 22x1",1,0,0,0,0,0,0,0,0,0]
["ABS77346.","RAL1013  ABS77346",1,0,0,0,0,0,0,0,0,0]
["ABS775 22x04","ABS775 HD28775",0.4,0,0,0,0,0,0,0,0,0]
["ABS775 22x2","ABS 22x2mm Redwood",2,0,0,0,0,0,0,0,0,0]
["ABS78087","RAL1013 ABS78087",1,0,0,0,0,0,0,0,0,0]
["ABS78087..","MIL004 ABS78087",1,0,0,0,0,0,0,0,0,0]
["ABS78087...","RAL1014 ABS78087",1,0,0,0,0,0,0,0,0,0]
["ABS78087R","MIL014 Bézs ABS78087",1,0,0,0,0,0,0,0,0,0]
["ABS78087R.","RAL1015 Bézs ABS78087",1,0,0,0,0,0,0,0,0,0]
["ABS78279","NCS S2060-R 40B ABS78279",1,0,0,0,0,0,0,0,0,0]
["ABS78279 22x1","ABS78279",1.3,0,0,0,0,0,0,0,0,0]
["ABS78280","RAL6027 ABS78280",1,0,0,0,0,0,0,0,0,0]
["ABS78281","RAL4007 ABS78281",1,0,0,0,0,0,0,0,0,0]
["ABS78978","RAL4007 ABS78978",1,0,0,0,0,0,0,0,0,0]
["ABS802 22x04","ABS 22x0,4mm Samembergi bükk",0,0,0,0,0,0,0,0,0,0]
["ABS802 22x2","ABS 22x2mm Samemberg bükk",2,0,0,0,0,0,0,0,0,0]
["ABS806 22x04","ABS22x0,4 HD241394",0.4,0,0,0,0,0,0,0,0,0]
["ABS806 22x2","ABS A806 22x2",2,0,0,0,0,0,0,0,0,0]
["ABS807 22x04","ABS807 22x04 Svájci Szilva",0.4,0,0,0,0,0,0,0,0,0]
["ABS807 22x2","ABS807 22x2mm Svájci szilva",2,0,0,0,0,0,0,0,0,0]
["ABS810 22x04","ABS810 HD221615",0.4,0,0,0,0,0,0,0,0,0]
["ABS810 22x2","ABS810 HD221615",2,0,0,0,0,0,0,0,0,0]
["ABS811 22x0,4","ABS A811 22x0.4 KASTAMONU",0.4,0,0,0,0,0,0,0,0,0]
["ABS814 22x04","ABS814 22x04 HD283058",0.4,0,0,0,0,0,0,0,0,0]
["ABS814 22x2","ABS814 22x2 HD283058",2,0,0,0,0,0,0,0,0,0]
["ABS815 22x04","ABS 22x0,4mm Bió fenyő",0.4,0,0,0,0,0,0,0,0,0]
["ABS815 22x2","ABS 22x2mm Bió fenyő",2,0,0,0,0,0,0,0,0,0]
["ABS816 22x2","ABS816 22x2 HD23352",2,0,0,0,0,0,0,0,0,0]
["ABS817 22x0.4","ABS A817 22x0,4 Wenge",0.4,0,0,0,0,0,0,0,0,0]
["ABS817 22x2","ABS A817 22x2 Wenge",2,0,0,0,0,0,0,0,0,0]
["ABS818 22x28","ABS22x28mm Bavaria bükk",2,0,0,0,0,0,0,0,0,0]
["ABS819 22x2","ABS819 22x2 HD24740",2,0,0,0,0,0,0,0,0,0]
["ABS820 22x04","ABS820 22x04 HD246837",0.4,0,0,0,0,0,0,0,0,0]
["ABS820 22x2","ABS820 22x2 HD246837",2,0,0,0,0,0,0,0,0,0]
["ABS821 22x04","ABS821 22x04 HD24327",0.4,0,0,0,0,0,0,0,0,0]
["ABS821 22x2","ABS821 22x2 HD24327",2,0,0,0,0,0,0,0,0,0]
["ABS824 22x04","ABS824 22x04 HD24326",0.4,0,0,0,0,0,0,0,0,0]
["ABS824 22x2","ABS824 22x2 HD24326",2,0,0,0,0,0,0,0,0,0]
["ABS825 22×0,4","ABS825 22×0,4  Mogyoró  HD280544",0.4,0,0,0,0,0,0,0,0,0]
["ABS825 22×2","ABS825  22×2  Mogyoró  HD280544",2,0,0,0,0,0,0,0,0,0]
["ABS826","ABSA826 22x04 HD29583",0.4,0,0,0,0,0,0,0,0,0,null,null,"Hranipex Kft"]
["ABS829 22x04","ABS 22x0,4mm Világos perrier",0.4,0,0,0,0,0,0,0,0,0]
["ABS829 22x2","ABS 22x2mm Világos perrier",2,0,0,0,0,0,0,0,0,0]
["ABS830 22x04","ABS830 22x0,4",0.4,0,0,0,0,0,0,0,0,0]
["ABS830 22x2","ABS830 22x2",2,0,0,0,0,0,0,0,0,0]
["ABS831 22x2","ABS A831 22x2mm Kantori tölgy  HD271137",2,0,0,0,0,0,0,0,0,0]
["ABS831 22×0,4","ABS A831 22×0,4 Kantori Tölgy HD281137",0.4,0,0,0,0,0,0,0,0,0]
["ABS832 22x2","ABS832 22x2",2,0,0,0,0,0,0,0,0,0]
["ABS833 22x2","ABS833",2,0,0,0,0,0,0,0,0,0]
["ABS834 22x04","ABS834 22x0,4mm HD221764",0.4,0,0,0,0,0,0,0,0,0]
["ABS834 22x2","ABS834 22x2mm HD221764",2,0,0,0,0,0,0,0,0,0]
["ABS839 22x2","ABS 22x2 A839 Kastamonu Creme",2,0,0,0,0,0,0,0,0,0]
["ABS842 22x04","ABS 22x0,4mm Világos tölgy",0.4,0,0,0,0,0,0,0,0,0]
["ABS842 22x2","ABS 22x2mm Világos tölgy",2,0,0,0,0,0,0,0,0,0]
["ABS845 22x0,4","ABS A845 22x0,4",0.4,0,0,0,0,0,0,0,0,0]
["ABS845 22x2","ABS A845 22x2",2,0,0,0,0,0,0,0,0,0]
["ABS847 22×2","ABS 22×2 A847 HD241146",2,0,0,0,0,0,0,0,0,0]
["ABS854 22x0,4","ABS FALCO 854 22x0,4",2,0,0,0,0,0,0,0,0,0]
["ABS854 22x2","ABS FALCO 854 22x2",2,0,0,0,0,0,0,0,0,0]
["ABS8547 22x2","ABS 22x2mm Fine Line világos",2,0,0,0,0,0,0,0,0,0]
["ABS876 22×2","ABS Kro876  22×2  HD211032",2,0,0,0,0,0,0,0,0,0]
["ABS929 22x05","ABS 22x0,5mm Acél csiszolt",0,0,0,0,0,0,0,0,0,0]
["ABS99027 22x1","ABS5499027 22x1 HD286094",1,0,0,0,0,0,0,0,0,0]
["ABS99027 22x2","ABS5499027 22x2 HD286094",2,0,0,0,0,0,0,0,0,0]
["ABSA 836 22x2","ABS A 836 22x2 Csoki Bükk",2,0,0,0,0,0,0,0,0,0]
["ABSA356 22x04"," ABS A 356 22x0,4 Classic Zebrano",0.4,0,0,0,0,0,0,0,0,0]
["ABSA356 22x2","ABS A356 22x2 Classic Zebrano",2,0,0,0,0,0,0,0,0,0]
["ABSA373 22x2","ABS A 373 22x2 Latin Walnut",2,0,0,0,0,0,0,0,0,0]
["ABSA373 22×04","ABS A373  22×0,4 Oliva  HD283031",0.4,0,0,0,0,0,0,0,0,0]
["ABSA380 22x04","ABS A380 22x0,4 Samba",0.4,0,0,0,0,0,0,0,0,0]
["ABSa380 22x2","ABS A380 22x2 Samba",2,0,0,0,0,0,0,0,0,0]
["ABSA415 22x04","ABSA415 22x04 HD293078",0.4,0,0,0,0,0,0,0,0,0]
["ABSA415 22x2","ABSA415 22x2 HD293078",2,0,0,0,0,0,0,0,0,0]
["ABSA418 22×2","ABS A418 Szilfa Moderato 22×2 HD253193",2,0,0,0,0,0,0,0,0,0]
["ABSA419 22×2","ABS A419  22×2     101R",2,0,0,0,0,0,0,0,0,0]
["ABSA423 22x2","ABSA423 22x2 HD268195",2,0,0,0,0,0,0,0,0,0]
["ABSA423 22×04","ABS A423  22×0,45   908C",0.4,0,0,0,0,0,0,0,0,0]
["ABSA423 22×1","ABS A 423  San Remo  22×1  701V",1,0,0,0,0,0,0,0,0,0]
["ABSA429 22x2","ABS A 429 22x2 ETNA",2,0,0,0,0,0,0,0,0,0]
["ABSA439 22x2","ABSA439 22x2 HD242542",2,0,0,0,0,0,0,0,0,0]
["ABSA800 22×04","ABS A 800 Cseresznye 22×0,4",0.4,0,0,0,0,0,0,0,0,0]
["ABSA800 22×2","ABS A 800 Cseresznye 22×2",2,0,0,0,0,0,0,0,0,0]
["ABSA808 22x1","ABSA808 22x1 HD24808",1,0,0,0,0,0,0,0,0,0]
["ABSA809 22×04","ABS A809 22×0,4 HD262040",0.4,0,0,0,0,0,0,0,0,0]
["ABSA809 22×2","ABS A809 Kőris Prelude 22×2 HD262040",2,0,0,0,0,0,0,0,0,0]
["ABSA811 22x2","ABS A811 22x2",2,0,0,0,0,0,0,0,0,0]
["ABSA811 42x2","ABSA811 42x2",2,0,0,0,0,0,0,0,0,0]
["ABSA812 22x04","ABS A812 22x0,4 Shertölgy",0.4,0,0,0,0,0,0,0,0,0]
["ABSA816 22×04","ABS A816 22×0,4  HD23352",0.4,0,0,0,0,0,0,0,0,0]
["ABSA816 22×1","ABS A816  22×1  HD 23352",1,0,0,0,0,0,0,0,0,0]
["ABSA816 22×2","ABS A816 22×2  HD23352",2,0,0,0,0,0,0,0,0,0]
["ABSA819 22×04","ABS A819  22×0,4  HD24740",0.4,0,0,0,0,0,0,0,0,0]
["ABSA820","ABS 22x2 Rift Oak Kastamonu",2,0,0,0,0,0,0,0,0,0]
["ABSA820 22×0,","ABS 22×0,4 HD246837",0.4,0,0,0,0,0,0,0,0,0]
["ABSA822 22×04","ABS A822  22×0,4  HD28476",0.4,0,0,0,0,0,0,0,0,0]
["ABSA822 22×2","ABS A822 22×2  HD 28476",2,0,0,0,0,0,0,0,0,0]
["ABSA826","ABSA826 22x2 HD29583",2,0,0,0,0,0,0,0,0,0,null,null,"Hranipex Kft"]
["ABSA826 22×2","ABS  A826  Laico Pine 22×2",2,0,0,0,0,0,0,0,0,0]
["ABSA827 22x04","ABS A827 22x0,4 Birch",0.4,0,0,0,0,0,0,0,0,0]
["ABSA827 22x2","ABS 22x2mm Nyír",2,0,0,0,0,0,0,0,0,0]
["ABSA833 22×04","ABS A833 22×0,4  HD241342",0.4,0,0,0,0,0,0,0,0,0]
["ABSA833 22×2","ABS A833 22×2  HD241342",2,0,0,0,0,0,0,0,0,0]
["ABSA834 22×2","ABS A834  22×2  HD221764",2,0,0,0,0,0,0,0,0,0]
["ABSA836 22x04","ABS A836 22x0,4 Csoki Bükk",0.4,0,0,0,0,0,0,0,0,0]
["ABSA836 22x2","ABS A836",0,0,0,0,0,0,0,0,0,0]
["ABSA838 22×2","ABS A838 22×2 Nero  HD293082",2,0,0,0,0,0,0,0,0,0]
["ABSA844 22x04","ABSA844 22x0,4 Vörös Fenyő",0.4,0,0,0,0,0,0,0,0,0]
["ABSA844 22x2","ABS A844 22x2 Dark Ida",2,0,0,0,0,0,0,0,0,0]
["ABSA846 22x04",null,0.4,0,0,0,0,0,0,0,0,0]
["ABSA846 22×04","ABS A846 22×0,4  Magos Bükk HD217707",0.4,0,0,0,0,0,0,0,0,0]
["ABSD104 22×04","ABS D104 Yvori 22×0,4  HU121302",0.4,0,0,0,0,0,0,0,0,0]
["ABSD104 22×2","ABS D104 Yvori 22×2  HU121302",2,0,0,0,0,0,0,0,0,0]
["ABSD108 22x04","ABS D108 22x0,4 Kék",0.4,0,0,0,0,0,0,0,0,0]
["ABSD108 22x2","ABS D108 22x2 Blue",2,0,0,0,0,0,0,0,0,0]
["ABSD114 22x2","ABSD114 22x2 HU14132",2,0,0,0,0,0,0,0,0,0]
["ABSD114 22×04","ABS D114 Orange 22×0,4  HU14132",0.4,0,0,0,0,0,0,0,0,0]
["ABSD116 22x04","ABSD116 22x04 HD29881",0.4,0,0,0,0,0,0,0,0,0]
["ABSD116 22x2","ABSD116 22x2 HD29881",2,0,0,0,0,0,0,0,0,0]
["ABSD117 22x04","ABSD117 22x04 HU13000",0.4,0,0,0,0,0,0,0,0,0]
["ABSD117 22x2","ABSD117 22x2 HU13000",2,0,0,0,0,0,0,0,0,0]
["ABSD118 22×04","ABS D118  22×0,4   HU12514",0.4,0,0,0,0,0,0,0,0,0]
["ABSD118 22×2","ABS D118   22×2     HU12514",2,0,0,0,0,0,0,0,0,0]
["ABSD122 22×04","ABS D122 Mink 22×0,4   HU121343",0.4,0,0,0,0,0,0,0,0,0]
["ABSD122 22×2","ABS D122 Mink 22×2  HU121343",2,0,0,0,0,0,0,0,0,0]
["ABSD125 22x04","ABSD125 22x04 U13125",0.4,0,0,0,0,0,0,0,0,0]
["ABSD125 22x2","ABSD125 22x2 HU 13125",2,0,0,0,0,0,0,0,0,0]
["ABSD126 22x2","ABSD126 22x2",2,0,0,0,0,0,0,0,0,0]
["ABSD126 22×07","ABS 22×0.7 Cappuccino KASTAMONU",0.7,0,0,0,0,0,0,0,0,0]
["ABSD129 22x04","ABS D129 PS14 22x0,4",0.4,0,0,0,0,0,0,0,0,0]
["ABSD129 22x2","ABSD129 22x2 HU10113",2,0,0,0,0,0,0,0,0,0]
["ABSD133 22x04","ABSD133 22x04 HU11131",0.4,0,0,0,0,0,0,0,0,0]
["ABSD133 22x2","ABSD133 22x2 HU11131",2,0,0,0,0,0,0,0,0,0]
["ABSD134 22×2","ABS D134 22×2 HU164177  Zöld",2,0,0,0,0,0,0,0,0,0]
["ABSD138 22x2","ABS 22x2mm Lila KASTAMONU",2,0,0,0,0,0,0,0,0,0]
["ABSD143 22x2","ABSD143 22x2 HU170231",2,0,0,0,0,0,0,0,0,0]
["ABSD143 22×04","ABS D143 22×0,4  HU170231",0.4,0,0,0,0,0,0,0,0,0]
["ABSD145 22x2","ABSD145 22x2 HU182512",2,0,0,0,0,0,0,0,0,0]
["ABSD149 22×1","ABS D149 22×2  Bordó HU 130149",1,0,0,0,0,0,0,0,0,0]
["ABSD152 28×2","ABS D152 28×2   HU10113",2,0,0,0,0,0,0,0,0,0]
["ABSD158 22x1","ABS D158 PS11 22x1 Galaxy",1,0,0,0,0,0,0,0,0,0]
["ABSD158 22x2","ABSD158 22x2",2,0,0,0,0,0,0,0,0,0]
["ABSD164 22x2","ABS D164 Kastamonu Luna",2,0,0,0,0,0,0,0,0,0]
["ABSD300 22x2","ABSD300 22x2",2,0,0,0,0,0,0,0,0,0]
["ABSD300 22×04","ABS D300 SzÜrkés Fehér 22×0,7",0.7,0,0,0,0,0,0,0,0,0]
["ABSD301 22x04","ABS D301 22x0,4 Titan",0.4,0,0,0,0,0,0,0,0,0]
["ABSD301 22x2","ABS D301 Titan 22x2",2,0,0,0,0,0,0,0,0,0]
["ABSD302 22x1","ABSD302 22x1",1,0,0,0,0,0,0,0,0,0]
["ABSD304 22×2","ABS D304 22×2  HU16617",2,0,0,0,0,0,0,0,0,0]
["ABSD6588 22x1","ABSD6588 22x1",1,0,0,0,0,0,0,0,0,0]
["ABSD6782 22x1","ABSD6782 22x1",1,0,0,0,0,0,0,0,0,0]
["ABSF105 22x2","ABS FAL105 Hófehér",2,0,0,0,0,0,0,0,0,0]
["ABSF123 22x2","ABS Falco 213 22x2 kék",2,0,0,0,0,0,0,0,0,0]
["ABSF186 22x1","ABSF186 22x1",1,0,0,0,0,0,0,0,0,0]
["ABSF187 22x04","ABSF187 22x0,4szürke beton",0.4,0,0,0,0,0,0,0,0,0]
["ABSF187 22x2","ABSF187 22x2",2,0,0,0,0,0,0,0,0,0]
["ABSF200 22x04","ABS Falco 200 22x0,4",0.4,0,0,0,0,0,0,0,0,0]
["ABSF200 22x2","ABS Falco 200 22x2 Fekete Erezett",2,0,0,0,0,0,0,0,0,0]
["ABSF238 22x2","ABS F238 22x2 Kastamonu",2,0,0,0,0,0,0,0,0,0]
["ABSF239 22x04","ABSF239 22x0,4 BEIGE TREND",0.4,0,0,0,0,0,0,0,0,0]
["ABSF239 22x2","ABSF239 22x2 BEIGE TREND",2,0,0,0,0,0,0,0,0,0]
["ABSF242 22x2","ABSF242 22x2",2,0,0,0,0,0,0,0,0,0]
["ABSF245 22x04","ABS F245 Pacific",0.4,0,0,0,0,0,0,0,0,0]
["ABSF275 22×1","ABS F275 Sötét Beton 22×1 HD29275",1,0,0,0,0,0,0,0,0,0]
["ABSF301 22x04","ABS FALCO 301 22x0,4 Capuccino",0.4,0,0,0,0,0,0,0,0,0]
["ABSF301 22x2","ABS FALCO 301 Capucinno 22x2",2,0,0,0,0,0,0,0,0,0]
["ABSF307 22×2","ABSF307 22×2  Pasztell sárga HU11307",2,0,0,0,0,0,0,0,0,0]
["ABSF314 22x2","ABSF314 22x2",2,0,0,0,0,0,0,0,0,0]
["ABSF329 22x04","ABSF329 22x04 HU32522",0.4,0,0,0,0,0,0,0,0,0]
["ABSF329 22x2","ABSF329 22x2  HU32522",2,0,0,0,0,0,0,0,0,0]
["ABSF348 22x04","ABSF348 22x2 HU12514",0.4,0,0,0,0,0,0,0,0,0]
["ABSF348 22x2","ABSF348 22x2 HU12514",2,0,0,0,0,0,0,0,0,0]
["ABSF403 22x04","ABSF403 22x0,4",0.4,0,0,0,0,0,0,0,0,0]
["ABSF403 22x2","ABSF403 22x2",2,0,0,0,0,0,0,0,0,0]
["ABSF417 22x04","ABS F 417 22x0,4",0.4,0,0,0,0,0,0,0,0,0]
["ABSF418 22×2","ABS Falco 418  22×2  Vancouver Juhar",0,0,0,0,0,0,0,0,0,0]
["ABSF458 22×2","ABS Falco 458  22×2     HD22458",2,0,0,0,0,0,0,0,0,0]
["ABSF461 22×2","ABS  F461  22×2  Country bükk  HD 21151",2,0,0,0,0,0,0,0,0,0]
["ABSF501 22x2","ABSF501 22x2 HD29501",2,0,0,0,0,0,0,0,0,0]
["ABSF509 22x04","ABSF509 22x04 HD29509",0.4,0,0,0,0,0,0,0,0,0]
["ABSF509 22×2","ABSF509  HD 29509",2,0,0,0,0,0,0,0,0,0]
["ABSF515 22x04","ABS Falco 515 Ardeni Fenyő",0.4,0,0,0,0,0,0,0,0,0]
["ABSF515 22x2","ABS Falco 515 22x2",2,0,0,0,0,0,0,0,0,0]
["ABSF535 2204","ABS FALCO 535 22x0,4",0.4,0,0,0,0,0,0,0,0,0]
["ABSF535 22x2","ABS FALCO 535 22x2",2,0,0,0,0,0,0,0,0,0]
["ABSF551 22x04","ABSF551 22x04 HU223129",0.4,0,0,0,0,0,0,0,0,0]
["ABSF551 22x2","ABSF551 22x2 HU223129",2,0,0,0,0,0,0,0,0,0]
["ABSF582 22×1","ABS FALCO 582 22×1 HD264330",1,0,0,0,0,0,0,0,0,0]
["ABSF584 22x04","ABS Falco 584 FS22 22x0,4",0.4,0,0,0,0,0,0,0,0,0]
["ABSF584 22x2","ABS Falco 584 FS22 22x2",2,0,0,0,0,0,0,0,0,0]
["ABSF586 22×04","ABS Falco 586  22×0,4  HD243215",0.4,0,0,0,0,0,0,0,0,0]
["ABSF586 22×2","ABS Falco 586 22×2  HD243215",2,0,0,0,0,0,0,0,0,0]
["ABSF611 22×1","ABS FALCO 611 22×1  HD252541",1,0,0,0,0,0,0,0,0,0]
["ABSF611 22×2","ABS FALCO 611 22×2  HD252541",2,0,0,0,0,0,0,0,0,0]
["ABSF61122×0,4","ABS FALCO 611 22×0,4  HD252541",0.4,0,0,0,0,0,0,0,0,0]
["ABSF616 2204","ABS FALCO 616 22x0,4",0.4,0,0,0,0,0,0,0,0,0]
["ABSF616 22x2","ABS FALCO 616 22x2",2,0,0,0,0,0,0,0,0,0]
["ABSF623 22x2","ABS Falco 623 FS22 22x2",2,0,0,0,0,0,0,0,0,0]
["ABSF649 22×2","ABS Falco 649  22×2  801260",2,0,0,0,0,0,0,0,0,0]
["ABSF698 22x04","ABS Falco 698 22x0.4",0.4,0,0,0,0,0,0,0,0,0]
["ABSF698 22x2","ABS Falco 698 22x2",2,0,0,0,0,0,0,0,0,0]
["ABSF727 22x04","ABS FALCO 727 Beige Textil 22x0.4",0.4,0,0,0,0,0,0,0,0,0]
["ABSF72722x2","ABS FALCO 727 SP15 22x2 Beige Textil",2,0,0,0,0,0,0,0,0,0]
["ABSFEKPR 22x2","ABS 22x2mm Prégelt fekete",2,0,0,0,0,0,0,0,0,0]
["ABSFeny feh","ABS 22x1mm Fényes fehér",0,0,0,0,0,0,0,0,0,0]
["ABSH1113 2204","ABSH1113 22x0,4",0.4,0,0,0,0,0,0,0,0,0]
["ABSH1113 22x2","ABSH1113 22x2   HD24004",2,0,0,0,0,0,0,0,0,0]
["ABSH1115 22x2","ABS H1115 ST12  22x2",2,0,0,0,0,0,0,0,0,0]
["ABSH1146 2204","ABS H1146 ST10 22x0,4",0.4,0,0,0,0,0,0,0,0,0]
["ABSH1180 22x0","ABSH1180 22x04",0.4,0,0,0,0,0,0,0,0,0]
["ABSH1180 22x1","ABSH1180 22x1",1,0,0,0,0,0,0,0,0,0]
["ABSH1180 22x2","ABSH1180 22x2",2,0,0,0,0,0,0,0,0,0]
["ABSH118022x04","ABSH1180 22x04",0.4,0,0,0,0,0,0,0,0,0]
["ABSH1181 22x2","ABS H 1181 22x2",2,0,0,0,0,0,0,0,0,0]
["ABSH1212 22x2","ABSH1212 22x2",2,0,0,0,0,0,0,0,0,0]
["ABSH1213 22x2","ABSH1213 22x2",2,0,0,0,0,0,0,0,0,0]
["ABSH1284 2","ABS H1284 22x2",2,0,0,0,0,0,0,0,0,0]
["ABSH1387 2204","ABS H1387 22x0,4",0.4,0,0,0,0,0,0,0,0,0]
["ABSH1387 22x2","ABS H1387 ST10 22x2",2,0,0,0,0,0,0,0,0,0]
["ABSH1401 2204","ABSH1401 22x04",0.4,0,0,0,0,0,0,0,0,0]
["ABSH1401 22x2","ABSH1401 22x2",2,0,0,0,0,0,0,0,0,0]
["ABSH142422×04","ABS H1424 Woodline krém 22×0,4",0.4,0,0,0,0,0,0,0,0,0]
["ABSH148722x04","ABS H1487 ST22 22x0,4",0.4,0,0,0,0,0,0,0,0,0]
["ABSH1636 22x2","ABSH1636 22x2",2,0,0,0,0,0,0,0,0,0]
["ABSH3030 22x2","ABSH3030 22x2",2,0,0,0,0,0,0,0,0,0]
["ABSH303022x04","ABSH3030 22x04",4,0,0,0,0,0,0,0,0,0]
["ABSH3031 22x2","ABS 22x2 Egger sötét oliva cordoba",2,0,0,0,0,0,0,0,0,0]
["ABSH3133 22x2","ABSH3133 22x2",2,0,0,0,0,0,0,0,0,0]
["ABSH3133 42x2","ABSH3133 42x2",2,0,0,0,0,0,0,0,0,0]
["ABSH3156 22x2","ABSH3156 22x2",2,0,0,0,0,0,0,0,0,0]
["ABSH3309 22x2","ABSH3309 22x2",2,0,0,0,0,0,0,0,0,0]
["ABSH3331 2204","ABS H3331 22x0,4",0.4,0,0,0,0,0,0,0,0,0]
["ABSH3331 22x2","ABSH3331 22x2 Natur Nebrasca Tölgy",2,0,0,0,0,0,0,0,0,0]
["ABSH3332 2204","ABS H3332 22x0,4",0.4,0,0,0,0,0,0,0,0,0]
["ABSH3332 22x2","ABSH3332 22x2",2,0,0,0,0,0,0,0,0,0]
["ABSH3430 04","ABS H3430 22x0,4",0.4,0,0,0,0,0,0,0,0,0]
["ABSH3433 22x2","ABSH3433 22x2",2,0,0,0,0,0,0,0,0,0]
["ABSH3451 22x2","ABSH3451 22x2 HD293451",2,0,0,0,0,0,0,0,0,0]
["ABSH3453 22x2","ABSH3453 22x2 HD293453",2,0,0,0,0,0,0,0,0,0]
["ABSH3700 2204","ABSH3700 22x0,4",0.4,0,0,0,0,0,0,0,0,0]
["ABSH3700 22x2","ABSH3700 22x2 HD283700",2,0,0,0,0,0,0,0,0,0]
["ABSH3702 2204","ABSH3702 22x0,4",0.4,0,0,0,0,0,0,0,0,0]
["ABSH3702 22x2","ABSH3702 22x2",2,0,0,0,0,0,0,0,0,0]
["ABSH3758 2204","ABS H3758 22x0,4 Nyír",0.4,0,0,0,0,0,0,0,0,0]
["ABSH3758 22x2","ABS H3758 22x2",2,0,0,0,0,0,0,0,0,0]
["ABSH3840 22x2","ABSH3840 22x2 HD263840",2,0,0,0,0,0,0,0,0,0]
["ABSHD130232","ABS HD130232  22×2  Rózsaszín",2,0,0,0,0,0,0,0,0,0]
["ABSHD281001","ABS S-6030-Y50R",1,0,0,0,0,0,0,0,0,0]
["ABSHD283031","ABS 22x1 HD283031",1,0,0,0,0,0,0,0,0,0]
["ABSHU10482","ABS HU10482 Fmax",1,0,0,0,0,0,0,0,0,0]
["ABSHU108681","ABS HU108681 22x1",1,0,0,0,0,0,0,0,0,0]
["ABSHU108681.","ABSHU108681 32x1",1,0,0,0,0,0,0,0,0,0]
["ABSHU10980","ABSHU10980 22x0,4",0.4,0,0,0,0,0,0,0,0,0]
["ABSHU119556","RAL1003 ABSHU119556",1,0,0,0,0,0,0,0,0,0]
["ABSHU12177","NCS S2010-Y30 R HU12177",1,0,0,0,0,0,0,0,0,0]
["ABSHU12216","RAL9001 ABSHU12216",1,0,0,0,0,0,0,0,0,0]
["ABSHU12514","RAL1015 ABSHU12514",1,0,0,0,0,0,0,0,0,0]
["ABSHU12516","RAL1013 ABSHU12516",1,0,0,0,0,0,0,0,0,0]
["ABSHU12516.","RAL1013 ABSHU12516",1,0,0,0,0,0,0,0,0,0]
["ABSHU12605","NCS S1010-Y30R",0,0,0,0,0,0,0,0,0,0]
["ABSHU13002","RAL3002 ABSHU13002",0,0,0,0,0,0,0,0,0,0]
["ABSHU13600","RAL3020 ABSHU13600",1,0,0,0,0,0,0,0,0,0]
["ABSHU13630","RAL3003 ABSHU13630",1,0,0,0,0,0,0,0,0,0]
["ABSHU13630."," RAL3001 ABSHU13630",1,0,0,0,0,0,0,0,0,0]
["ABSHU138677","RAL3002 ABSHU138677",1,0,0,0,0,0,0,0,0,0]
["ABSHU15516","RAL4008 ABSHU15516",1,0,0,0,0,0,0,0,0,0]
["ABSHU15516.","MIL606  ABSHU15516",1,0,0,0,0,0,0,0,0,0]
["ABSHU15516..","ABSHU15516 RAL4006",1,0,0,0,0,0,0,0,0,0]
["ABSHU16219","ABSHU16219  NCS S 1075-G70Y",0,0,0,0,0,0,0,0,0,0]
["ABSHU16219.","NCS S1075-G-70Y ABSHU16219",1,0,0,0,0,0,0,0,0,0]
["ABSHU16568","ABSHU16568 Zöld",1,0,0,0,0,0,0,0,0,0]
["ABSHU170075","NCS 6502-R ABSHU170075",1,0,0,0,0,0,0,0,0,0]
["ABSHU17164","NCS S8000-N ABSHU17164",0,0,0,0,0,0,0,0,0,0]
["ABSHU17164.","RAL7024 ABS17164",1,0,0,0,0,0,0,0,0,0]
["ABSHU17164...","RAL6018 ABSHU17164",1,0,0,0,0,0,0,0,0,0]
["ABSHU172162","ABSHU 172162 22x1mm",1,0,0,0,0,0,0,0,0,0]
["ABSHU180319","ABSHU180319 RAL1019",1,0,0,0,0,0,0,0,0,0]
["ABSHU18180","RAL1011 ABSHU18180",1,0,0,0,0,0,0,0,0,0]
["ABSHU187166","RAL7006 ABSHU187166",1,0,0,0,0,0,0,0,0,0]
["ABSHU187166,","RAL1013 ABSHU187166",1,0,0,0,0,0,0,0,0,0]
["ABSHU187166,,","RAL7034 ABSHU187166",1,0,0,0,0,0,0,0,0,0]
["ABSHU187166.,","RAL8025 ABSHU187166",1,0,0,0,0,0,0,0,0,0]
["ABSHU188533.","NCS S2010-Y 40R ABSHU188533",1,0,0,0,0,0,0,0,0,0]
["ABSHU19015","RAL9005 ABSHU19015",1,0,0,0,0,0,0,0,0,0]
["ABSHU_16219","ABS22x2 HU16219",2,0,0,0,0,0,0,0,0,0]
["ABSKék 22×0,4","ABS Kék 22×0,4 HU15540",0.4,0,0,0,0,0,0,0,0,0]
["ABSKék 22×2","ABS Kék 22×2 HU15540",2,0,0,0,0,0,0,0,0,0]
["ABSM271 22x1","ABS M271 22x1 Fényes Antracit",1,0,0,0,0,0,0,0,0,0]
["ABSP101 22x1","ABS P101 22x1 Magasfényű Krém",1,0,0,0,0,0,0,0,0,0]
["ABSP103 22x1","ABS P103 22x1 Magasfényű Capuccino",1,0,0,0,0,0,0,0,0,0]
["ABSPiros 22x1","ABS 22x1mm Piros fényes",1,0,0,0,0,0,0,0,0,0]
["ABSPR 42x1","ABS 42x1mm Prégelt fehér",1,0,0,0,0,0,0,0,0,0]
["ABSPR FEK.","ABS 22×0,4 HU 19015",0.4,0,0,0,0,0,0,0,0,0]
["ABSPRFEH 04","ABS22x04 Prégelt fehér",1,0,0,0,0,0,0,0,0,0]
["ABSPRFEH 22x2","ABSPRFEH 22x2",2,0,0,0,0,0,0,0,0,0]
["ABSPRFEK","ABS 22x2mm Prég.fekete",2,0,0,0,0,0,0,0,0,0]
["ABSRAL6027","RAL     ABS78280",1,0,0,0,0,0,0,0,0,0]
["ABSU",null,0,0,0,0,0,0,0,0,0,0]
["ABSU108 22x04","ABSU108 22x0.4 HU12514",0.4,0,0,0,0,0,0,0,0,0]
["ABSU108 22x2","ABSU108 22x2 HU12514 Gy",2,0,0,0,0,0,0,0,0,0]
["ABSU114 22x2","ABSU114 22x2",2,0,0,0,0,0,0,0,0,0]
["ABSU116 0,4","ABS 22x0,4mm Jázmin",0,0,0,0,0,0,0,0,0,0]
["ABSU116 22x2","ABS 22x2mm Jázmin",2,0,0,0,0,0,0,0,0,0]
["ABSU156 22x0,","ABS 22x0,4mm Homoksárga EGGER",0,0,0,0,0,0,0,0,0,0]
["ABSU156 22x2","ABS 22x2mm Homoksárga EGGER",2,0,0,0,0,0,0,0,0,0]
["ABSU201 22x04","ABS U201 22x0,4",0.4,0,0,0,0,0,0,0,0,0]
["ABSU201 22x2","ABSU201 22x2",2,0,0,0,0,0,0,0,0,0]
["ABSU203 22x2","ABS 22x2mm Karamell EGGER",2,0,0,0,0,0,0,0,0,0]
["ABSU204 22×2","ABS 22×2mm Camel HU12204",2,0,0,0,0,0,0,0,0,0]
["ABSU222 22x04","ABSU222 22x04",0.4,0,0,0,0,0,0,0,0,0]
["ABSU222 22x2","ABS 22x2mm Krém",2,0,0,0,0,0,0,0,0,0]
["ABSU224 22×2","ABS U224 Bézs Selyem 22×2  HU122507",2,0,0,0,0,0,0,0,0,0]
["ABSU311 22×04","ABS U311  22×0,4  HU13311",0.4,0,0,0,0,0,0,0,0,0]
["ABSU311 22×1","ABS U311  22×1  HU13311",1,0,0,0,0,0,0,0,0,0]
["ABSU311 22×2","ABS 22×2  HU 13311",2,0,0,0,0,0,0,0,0,0]
["ABSU321 22x2","ABSU321 22x2",2,0,0,0,0,0,0,0,0,0]
["ABSU323 22×2","ABS U323  piros 22×2  HU13003",2,0,0,0,0,0,0,0,0,0]
["ABSU337 22×2","ABSU337  Lila  22×2    137D",2,0,0,0,0,0,0,0,0,0]
["ABSU363 22x2","ABS U363 22x2 rózsa",2,0,0,0,0,0,0,0,0,0]
["ABSU504 22x2","ABSU504 22x2",2,0,0,0,0,0,0,0,0,0]
["ABSU522 22x04","ABSU522 22x0,4mm",0.4,0,0,0,0,0,0,0,0,0]
["ABSU522 22x2","ABSU522 22x2",2,0,0,0,0,0,0,0,0,0]
["ABSU525 22x04","ABSU525 22x04 HU15525",0.4,0,0,0,0,0,0,0,0,0]
["ABSU53222×0,4","ABS U532 22×0,4  HU15532",0.4,0,0,0,0,0,0,0,0,0]
["ABSU539 22x2","ABSU539 HU15539 22x2",2,0,0,0,0,0,0,0,0,0]
["ABSU626 22×04","ABSU626 22×0,4 Kiwi Zöld  HU16626",0.4,0,0,0,0,0,0,0,0,0]
["ABSU626 22×2","ABSU626 22×2 Kiwi Zöld  HU16626",2,0,0,0,0,0,0,0,0,0]
["ABSU630 22/2","ABS 22/2 HU 16219",2,0,0,0,0,0,0,0,0,0]
["ABSU630 22x04","ABSU630 22x04 HU16630",0.4,0,0,0,0,0,0,0,0,0]
["ABSU632 22x04","ABSU632 22x04 127K",0.4,0,0,0,0,0,0,0,0,0]
["ABSU632 22×2","ABSU632  Fűzöld  22×2     127K",2,0,0,0,0,0,0,0,0,0]
["ABSU633 22x2","ABSU633 22x2 HU150595",2,0,0,0,0,0,0,0,0,0]
["ABSU702 22x04","ABS U702 22x0,4 Egger",0.4,0,0,0,0,0,0,0,0,0]
["ABSU702 22x1","ABSU702 22x1mm",1,0,0,0,0,0,0,0,0,0]
["ABSU702 22x2","ABS U702 22x2 Egger",2,0,0,0,0,0,0,0,0,0]
["ABSU707 22x1","ABSU707 22x1",1,0,0,0,0,0,0,0,0,0]
["AbsU70722x2","ABS U707 22x2",2,0,0,0,0,0,0,0,0,0]
["ABSU708 22x04","ABSU708 22x0,4",0.4,0,0,0,0,0,0,0,0,0]
["ABSU708 22x2","ABSU708 22x2",2,0,0,0,0,0,0,0,0,0]
["ABSU727 22x04","ABSU727 22x04 HU17727",0.4,0,0,0,0,0,0,0,0,0]
["ABSU727 22x2","ABSU727 22x2 HU17727",2,0,0,0,0,0,0,0,0,0]
["ABSU732 22x04","ABSU732 22x04",0.4,0,0,0,0,0,0,0,0,0]
["ABSU732 22x2","ABSU732 22x2mm",2,0,0,0,0,0,0,0,0,0]
["ABSU750 22x2","ABSU750 22x2",2,0,0,0,0,0,0,0,0,0]
["ABSU763 22x2","ABSU763 22x2 HU171700 ERH",2,0,0,0,0,0,0,0,0,0]
["ABSU763 22×2","ABSU763 22×2       19L",2,0,0,0,0,0,0,0,0,0]
["ABSU763 42x2","ABSU763 42x2 HU171700 ERH",2,0,0,0,0,0,0,0,0,0]
["ABSU767 22x04","ABSU767 22x04",0.1,0,0,0,0,0,0,0,0,0]
["ABSU767 22x2","ABSU767 22x2",2,0,0,0,0,0,0,0,0,0]
["ABSU773 22x2","ABSU773 22x2",2,0,0,0,0,0,0,0,0,0]
["ABSU775 2204","ABSU775 22x0,4",0.4,0,0,0,0,0,0,0,0,0]
["ABSU775 22x2","ABSU775 22x2",2,0,0,0,0,0,0,0,0,0]
["ABSU788 22x2","ABSU788 22x2  hU17788",2,0,0,0,0,0,0,0,0,0]
["ABSU788 22×04","ABSU788 22×0,4  HU17788",0.4,0,0,0,0,0,0,0,0,0]
["ABSU961 22x04","ABSU961 22x04  HU17961",0.4,0,0,0,0,0,0,0,0,0]
["ABSU961 22×2","ABSU961 22x2 HU17961",2,0,0,0,0,0,0,0,0,0]
["ABSV0953","ABSV0953 RAL3003",1,0,0,0,0,0,0,0,0,0]
["ABSV1272","NCS S5010-Y50R ABSV1272",1,0,0,0,0,0,0,0,0,0]
["ABSW1000ST38","ABSW1000ST38 22x2",2,0,0,0,0,0,0,0,0,0]
["ABSW1000ST9","ABS W1000 ST9 22x2",2,0,0,0,0,0,0,0,0,0]
["ABSW908 22x2","ABS 22x2mm Korpuszfehér EGGER",2,0,0,0,0,0,0,0,0,0,null,20130417141802,"Hranipex Kft"]
["Bukk 22×0,5","Élléc 22×0,5 Bukk",0.5,0,0,0,0,0,0,0,0,0]
["Bukk el 22x2","Élléc 22x2mm Bükk",2,0,0,0,0,0,0,0,0,0]
["Cseri él 22X2","Élléc 22x2 Cseresznye",2,0,0,0,0,0,0,0,0,0]
["DIO el 22x05","Élléc 22x0,5 Dió",0.5,0,0,0,0,0,0,0,0,0]
["Dio el 22×2","Élléc 22×2mm Dió",2,0,0,0,0,0,0,0,0,0]
["Duplung","Duplung",0,0,0,0,0,0,0,0,0,0]
["Fenyo 22x05","Élléc 22x0,5 Fenyő",0.5,0,0,0,0,0,0,0,0,0]
["Fenyo 22×2","Élléc 22×2 Fenyő élléc",2,0,0,0,0,0,0,0,0,0]
["H 3758 22x2","ABS H3758 22x2 Nyír",2,0,0,0,0,0,0,0,0,0]
["H3171 22x2","ABS H3171 22x2 Olajos Tölgy",2,0,0,0,0,0,0,0,0,0]
["Juhar 22x0,5","Élléc Juhar 22x0,5",0.5,0,0,0,0,0,0,0,0,0]
["Juhar 22x2","Élléc 22x2mm Juhar",2,0,0,0,0,0,0,0,0,0]
["Köris 22x0,5","Élléc köris 22x0,5",0.5,0,0,0,0,0,0,0,0,0]
["Köris 22x2","Élléc Köris 22x2",2,0,0,0,0,0,0,0,0,0]
["PH","Pánthely fúrás",2,0,0,0,0,0,0,0,0,0]
["SZA 0,4","Színazonos 0,4",0.4,0,0,0,0,0,0,0,0,0]
["SZA 2","Színazonos 2",2,0,0,0,0,0,0,0,0,0]
["Szögvágás","Szögvágás",0,0,0,0,0,0,0,0,0,0]
["Tolgy 22x05","Élfurnér 22x0,5",0.5,0,0,0,0,0,0,0,0,0]
["Tölgy 22×2","Éléc 22x2mm Tölgy",2,0,0,0,0,0,0,0,0,0,null,20130418063102]