{"text_format":"3","workbook":"xlsx","n_sheets":3,"sheets":["Megrendelés","Bútorlapok","Élzárók"],"not_rendered":{"images":1,"macros":1,"external_links":1,"defined_names":7},"read":"whole","date_system":"1900"}

{"sheet":"Megrendelés","index":0,"n_rows":106,"n_cols":15,"rows_kept":106,"merged":[[0,0,0,1],[0,2,0,5],[1,0,1,1],[1,2,1,5],[2,0,2,1],[2,2,2,5],[3,0,3,1],[3,2,3,5],[4,0,4,1],[4,2,4,5],[5,0,5,1],[5,2,5,5],[6,0,6,5],[6,6,6,9],[6,10,6,13],[6,14,7,14]]}
["Megrendelő neve*:"]
["Számlázási címe*:"]
["Elérhetősége telefon*:"]
["Email:"]
["Szállítási határidő*:"]
["Szállítási raklapot kér (igen/nem):"]
["Bútorlap",{"$nulls":5},"Élzárás 0,4 mm vastagságban",{"$nulls":3},"Élzárás 2 mm vastagságban",{"$nulls":3},"Kitöltési hibák"]
["Azonosító","Megnevezés","Hosszúság (mm)","Szélesség (mm)","Mennyiség (darab)","Megjegyzés","Hossz. él (0,1,2) (darab)","Szél. él (0,1,2) (darab)","Azonosító","Megnevezés","Hossz. él (0,1,2) (darab)","Szél. él (0,1,2) (darab)","Azonosító","Megnevezés"]
["40300",{"$f":"IFERROR(VLOOKUP(A9,Bútorlapok!$A:$B,2),\"\")","v":"40300 Borovi tábla HT A/A"},1000,2000,11,null,1,1,"5499009 22x04",{"$f":"IFERROR(VLOOKUP(I9,Élzárók!$A:$B,2),\"\")","v":"ABS5499009 22x04"},1,1,"54990009 22x2",{"$f":"IFERROR(VLOOKUP(M9,Élzárók!$A:$B,2),\"\")","v":"ABS5499009 22x2"},{"$f":"IF(G9+H9+K9+L9>4,\"Az élzárások össz darabszáma maximum 4 lehet!\",\"\")","v":""}]
["40315",{"$f":"IFERROR(VLOOKUP(A10,Bútorlapok!$A:$B,2),\"\")","v":"40315 Borovi Tábla HT A/Akevert"},100,200,22,null,1,1,"5499035 22x04",{"$f":"IFERROR(VLOOKUP(I10,Élzárók!$A:$B,2),\"\")","v":"ABS5499035 22x0,4"},1,1,"5499031 22x2",{"$f":"IFERROR(VLOOKUP(M10,Élzárók!$A:$B,2),\"\")","v":"ABS5499031 22×0,4"},{"$f":"IF(G10+H10+K10+L10>4,\"Az élzárások össz darabszáma maximum 4 lehet!\",\"\")","v":""}]
["54721",{"$f":"IFERROR(VLOOKUP(A11,Bútorlapok!$A:$B,2),\"\")","v":"54721 Forgácslap Szürke PE-II"},500,500,10,null,1,2,"ABS5472122x04",{"$f":"IFERROR(VLOOKUP(I11,Élzárók!$A:$B,2),\"\")","v":"ABS54721 22x04 98463"},1,null,"ABS54721 42x2",{"$f":"IFERROR(VLOOKUP(M11,Élzárók!$A:$B,2),\"\")","v":"ABS54721 42x2"},{"$f":"IF(G11+H11+K11+L11>4,\"Az élzárások össz darabszáma maximum 4 lehet!\",\"\")","v":""}]
["",{"$f":"IFERROR(VLOOKUP(A12,Bútorlapok!$A:$B,2),\"\")","v":""},{"$nulls":6},"",{"$f":"IFERROR(VLOOKUP(I12,Élzárók!$A:$B,2),\"\")","v":""},null,null,"",{"$f":"IFERROR(VLOOKUP(M12,Élzárók!$A:$B,2),\"\")","v":""},{"$f":"IF(G12+H12+K12+L12>4,\"Az élzárások össz darabszáma maximum 4 lehet!\",\"\")","v":""}]
[null,{"$f":"IFERROR(VLOOKUP(A13,Bútorlapok!$A:$B,2),\"\")","v":""},{"$nulls":7},{"$f":"IFERROR(VLOOKUP(I13,Élzárók!$A:$B,2),\"\")","v":""},{"$nulls":3},{"$f":"IFERROR(VLOOKUP(M13,Élzárók!$A:$B,2),\"\")","v":""}]
[null,{"$f":"IFERROR(VLOOKUP(A14,Bútorlapok!$A:$B,2),\"\")","v":""},{"$nulls":7},{"$f":"IFERROR(VLOOKUP(I14,Élzárók!$A:$B,2),\"\")","v":""},null,null,"",{"$f":"IFERROR(VLOOKUP(M14,Élzárók!$A:$B,2),\"\")","v":""}]
[null,{"$f":"IFERROR(VLOOKUP(A15,Bútorlapok!$A:$B,2),\"\")","v":""},{"$nulls":7},{"$f":"IFERROR(VLOOKUP(I15,Élzárók!$A:$B,2),\"\")","v":""},null,null,"",{"$f":"IFERROR(VLOOKUP(M15,Élzárók!$A:$B,2),\"\")","v":""}]
[null,{"$f":"IFERROR(VLOOKUP(A16,Bútorlapok!$A:$B,2),\"\")","v":""},{"$nulls":7},{"$f":"IFERROR(VLOOKUP(I16,Élzárók!$A:$B,2),\"\")","v":""},{"$nulls":3},{"$f":"IFERROR(VLOOKUP(M16,Élzárók!$A:$B,2),\"\")","v":""}]
[null,{"$f":"IFERROR(VLOOKUP(A17,Bútorlapok!$A:$B,2),\"\")","v":""},{"$nulls":7},{"$f":"IFERROR(VLOOKUP(I17,Élzárók!$A:$B,2),\"\")","v":""},{"$nulls":3},{"$f":"IFERROR(VLOOKUP(M17,Élzárók!$A:$B,2),\"\")","v":""}]
[null,{"$f":"IFERROR(VLOOKUP(A18,Bútorlapok!$A:$B,2),\"\")","v":""},{"$nulls":7},{"$f":"IFERROR(VLOOKUP(I18,Élzárók!$A:$B,2),\"\")","v":""},null,null,"",{"$f":"IFERROR(VLOOKUP(M18,Élzárók!$A:$B,2),\"\")","v":""}]
[null,{"$f":"IFERROR(VLOOKUP(A19,Bútorlapok!$A:$B,2),\"\")","v":""},{"$nulls":7},{"$f":"IFERROR(VLOOKUP(I19,Élzárók!$A:$B,2),\"\")","v":""},{"$nulls":3},{"$f":"IFERROR(VLOOKUP(M19,Élzárók!$A:$B,2),\"\")","v":""}]
[null,{"$f":"IFERROR(VLOOKUP(A20,Bútorlapok!$A:$B,2),\"\")","v":""},{"$nulls":7},{"$f":"IFERROR(VLOOKUP(I20,Élzárók!$A:$B,2),\"\")","v":""},{"$nulls":3},{"$f":"IFERROR(VLOOKUP(M20,Élzárók!$A:$B,2),\"\")","v":""}]
[null,{"$f":"IFERROR(VLOOKUP(A21,Bútorlapok!$A:$B,2),\"\")","v":""},{"$nulls":7},{"$f":"IFERROR(VLOOKUP(I21,Élzárók!$A:$B,2),\"\")","v":""},{"$nulls":3},{"$f":"IFERROR(VLOOKUP(M21,Élzárók!$A:$B,2),\"\")","v":""}]
[null,{"$f":"IFERROR(VLOOKUP(A22,Bútorlapok!$A:$B,2),\"\")","v":""},{"$nulls":7},{"$f":"IFERROR(VLOOKUP(I22,Élzárók!$A:$B,2),\"\")","v":""},{"$nulls":3},{"$f":"IFERROR(VLOOKUP(M22,Élzárók!$A:$B,2),\"\")","v":""}]
[null,{"$f":"IFERROR(VLOOKUP(A23,Bútorlapok!$A:$B,2),\"\")","v":""},{"$nulls":7},{"$f":"IFERROR(VLOOKUP(I23,Élzárók!$A:$B,2),\"\")","v":""},{"$nulls":3},{"$f":"IFERROR(VLOOKUP(M23,Élzárók!$A:$B,2),\"\")","v":""}]
[null,{"$f":"IFERROR(VLOOKUP(A24,Bútorlapok!$A:$B,2),\"\")","v":""},{"$nulls":7},{"$f":"IFERROR(VLOOKUP(I24,Élzárók!$A:$B,2),\"\")","v":""},{"$nulls":3},{"$f":"IFERROR(VLOOKUP(M24,Élzárók!$A:$B,2),\"\")","v":""}]
["",{"$f":"IFERROR(VLOOKUP(A25,Bútorlapok!$A:$B,2),\"\")","v":""},{"$nulls":7},{"$f":"IFERROR(VLOOKUP(I25,Élzárók!$A:$B,2),\"\")","v":""},{"$nulls":3},{"$f":"IFERROR(VLOOKUP(M25,Élzárók!$A:$B,2),\"\")","v":""}]
["",{"$f":"IFERROR(VLOOKUP(A26,Bútorlapok!$A:$B,2),\"\")","v":""},{"$nulls":7},{"$f":"IFERROR(VLOOKUP(I26,Élzárók!$A:$B,2),\"\")","v":""},{"$nulls":3},{"$f":"IFERROR(VLOOKUP(M26,Élzárók!$A:$B,2),\"\")","v":""}]
["",{"$f":"IFERROR(VLOOKUP(A27,Bútorlapok!$A:$B,2),\"\")","v":""},{"$nulls":7},{"$f":"IFERROR(VLOOKUP(I27,Élzárók!$A:$B,2),\"\")","v":""},{"$nulls":3},{"$f":"IFERROR(VLOOKUP(M27,Élzárók!$A:$B,2),\"\")","v":""}]
["",{"$f":"IFERROR(VLOOKUP(A28,Bútorlapok!$A:$B,2),\"\")","v":""},{"$nulls":7},{"$f":"IFERROR(VLOOKUP(I28,Élzárók!$A:$B,2),\"\")","v":""},{"$nulls":3},{"$f":"IFERROR(VLOOKUP(M28,Élzárók!$A:$B,2),\"\")","v":""}]
["",{"$f":"IFERROR(VLOOKUP(A29,Bútorlapok!$A:$B,2),\"\")","v":""},{"$nulls":7},{"$f":"IFERROR(VLOOKUP(I29,Élzárók!$A:$B,2),\"\")","v":""},{"$nulls":3},{"$f":"IFERROR(VLOOKUP(M29,Élzárók!$A:$B,2),\"\")","v":""}]
["",{"$f":"IFERROR(VLOOKUP(A30,Bútorlapok!$A:$B,2),\"\")","v":""},{"$nulls":7},{"$f":"IFERROR(VLOOKUP(I30,Élzárók!$A:$B,2),\"\")","v":""},{"$nulls":3},{"$f":"IFERROR(VLOOKUP(M30,Élzárók!$A:$B,2),\"\")","v":""}]
[null,{"$f":"IFERROR(VLOOKUP(A31,Bútorlapok!$A:$B,2),\"\")","v":""},{"$nulls":7},{"$f":"IFERROR(VLOOKUP(I31,Élzárók!$A:$B,2),\"\")","v":""},{"$nulls":3},{"$f":"IFERROR(VLOOKUP(M31,Élzárók!$A:$B,2),\"\")","v":""}]
["",{"$f":"IFERROR(VLOOKUP(A32,Bútorlapok!$A:$B,2),\"\")","v":""},{"$nulls":7},{"$f":"IFERROR(VLOOKUP(I32,Élzárók!$A:$B,2),\"\")","v":""},{"$nulls":3},{"$f":"IFERROR(VLOOKUP(M32,Élzárók!$A:$B,2),\"\")","v":""}]
[null,{"$f":"IFERROR(VLOOKUP(A33,Bútorlapok!$A:$B,2),\"\")","v":""},{"$nulls":7},{"$f":"IFERROR(VLOOKUP(I33,Élzárók!$A:$B,2),\"\")","v":""},{"$nulls":3},{"$f":"IFERROR(VLOOKUP(M33,Élzárók!$A:$B,2),\"\")","v":""}]
[null,{"$f":"IFERROR(VLOOKUP(A34,Bútorlapok!$A:$B,2),\"\")","v":""},{"$nulls":7},{"$f":"IFERROR(VLOOKUP(I34,Élzárók!$A:$B,2),\"\")","v":""},{"$nulls":3},{"$f":"IFERROR(VLOOKUP(M34,Élzárók!$A:$B,2),\"\")","v":""}]
[null,{"$f":"IFERROR(VLOOKUP(A35,Bútorlapok!$A:$B,2),\"\")","v":""},{"$nulls":7},{"$f":"IFERROR(VLOOKUP(I35,Élzárók!$A:$B,2),\"\")","v":""},{"$nulls":3},{"$f":"IFERROR(VLOOKUP(M35,Élzárók!$A:$B,2),\"\")","v":""}]
[null,{"$f":"IFERROR(VLOOKUP(A36,Bútorlapok!$A:$B,2),\"\")","v":""},{"$nulls":7},{"$f":"IFERROR(VLOOKUP(I36,Élzárók!$A:$B,2),\"\")","v":""},{"$nulls":3},{"$f":"IFERROR(VLOOKUP(M36,Élzárók!$A:$B,2),\"\")","v":""}]
[null,{"$f":"IFERROR(VLOOKUP(A37,Bútorlapok!$A:$B,2),\"\")","v":""},{"$nulls":7},{"$f":"IFERROR(VLOOKUP(I37,Élzárók!$A:$B,2),\"\")","v":""},{"$nulls":3},{"$f":"IFERROR(VLOOKUP(M37,Élzárók!$A:$B,2),\"\")","v":""}]
[null,{"$f":"IFERROR(VLOOKUP(A38,Bútorlapok!$A:$B,2),\"\")","v":""},{"$nulls":7},{"$f":"IFERROR(VLOOKUP(I38,Élzárók!$A:$B,2),\"\")","v":""},{"$nulls":3},{"$f":"IFERROR(VLOOKUP(M38,Élzárók!$A:$B,2),\"\")","v":""}]
[null,{"$f":"IFERROR(VLOOKUP(A39,Bútorlapok!$A:$B,2),\"\")","v":""},{"$nulls":7},{"$f":"IFERROR(VLOOKUP(I39,Élzárók!$A:$B,2),\"\")","v":""},{"$nulls":3},{"$f":"IFERROR(VLOOKUP(M39,Élzárók!$A:$B,2),\"\")","v":""}]
[null,{"$f":"IFERROR(VLOOKUP(A40,Bútorlapok!$A:$B,2),\"\")","v":""},{"$nulls":7},{"$f":"IFERROR(VLOOKUP(I40,Élzárók!$A:$B,2),\"\")","v":""},{"$nulls":3},{"$f":"IFERROR(VLOOKUP(M40,Élzárók!$A:$B,2),\"\")","v":""}]
[null,{"$f":"IFERROR(VLOOKUP(A41,Bútorlapok!$A:$B,2),\"\")","v":""},{"$nulls":7},{"$f":"IFERROR(VLOOKUP(I41,Élzárók!$A:$B,2),\"\")","v":""},{"$nulls":3},{"$f":"IFERROR(VLOOKUP(M41,Élzárók!$A:$B,2),\"\")","v":""}]
[null,{"$f":"IFERROR(VLOOKUP(A42,Bútorlapok!$A:$B,2),\"\")","v":""},{"$nulls":7},{"$f":"IFERROR(VLOOKUP(I42,Élzárók!$A:$B,2),\"\")","v":""},{"$nulls":3},{"$f":"IFERROR(VLOOKUP(M42,Élzárók!$A:$B,2),\"\")","v":""}]
[null,{"$f":"IFERROR(VLOOKUP(A43,Bútorlapok!$A:$B,2),\"\")","v":""},{"$nulls":7},{"$f":"IFERROR(VLOOKUP(I43,Élzárók!$A:$B,2),\"\")","v":""},{"$nulls":3},{"$f":"IFERROR(VLOOKUP(M43,Élzárók!$A:$B,2),\"\")","v":""}]
[null,{"$f":"IFERROR(VLOOKUP(A44,Bútorlapok!$A:$B,2),\"\")","v":""},{"$nulls":7},{"$f":"IFERROR(VLOOKUP(I44,Élzárók!$A:$B,2),\"\")","v":""},{"$nulls":3},{"$f":"IFERROR(VLOOKUP(M44,Élzárók!$A:$B,2),\"\")","v":""}]
[null,{"$f":"IFERROR(VLOOKUP(A45,Bútorlapok!$A:$B,2),\"\")","v":""},{"$nulls":7},{"$f":"IFERROR(VLOOKUP(I45,Élzárók!$A:$B,2),\"\")","v":""},{"$nulls":3},{"$f":"IFERROR(VLOOKUP(M45,Élzárók!$A:$B,2),\"\")","v":""}]
[null,{"$f":"IFERROR(VLOOKUP(A46,Bútorlapok!$A:$B,2),\"\")","v":""},{"$nulls":7},{"$f":"IFERROR(VLOOKUP(I46,Élzárók!$A:$B,2),\"\")","v":""},{"$nulls":3},{"$f":"IFERROR(VLOOKUP(M46,Élzárók!$A:$B,2),\"\")","v":""}]
[null,{"$f":"IFERROR(VLOOKUP(A47,Bútorlapok!$A:$B,2),\"\")","v":""},{"$nulls":7},{"$f":"IFERROR(VLOOKUP(I47,Élzárók!$A:$B,2),\"\")","v":""},{"$nulls":3},{"$f":"IFERROR(VLOOKUP(M47,Élzárók!$A:$B,2),\"\")","v":""}]
[null,{"$f":"IFERROR(VLOOKUP(A48,Bútorlapok!$A:$B,2),\"\")","v":""},{"$nulls":7},{"$f":"IFERROR(VLOOKUP(I48,Élzárók!$A:$B,2),\"\")","v":""},{"$nulls":3},{"$f":"IFERROR(VLOOKUP(M48,Élzárók!$A:$B,2),\"\")","v":""}]
[null,{"$f":"IFERROR(VLOOKUP(A49,Bútorlapok!$A:$B,2),\"\")","v":""},{"$nulls":7},{"$f":"IFERROR(VLOOKUP(I49,Élzárók!$A:$B,2),\"\")","v":""},{"$nulls":3},{"$f":"IFERROR(VLOOKUP(M49,Élzárók!$A:$B,2),\"\")","v":""}]
[null,{"$f":"IFERROR(VLOOKUP(A50,Bútorlapok!$A:$B,2),\"\")","v":""},{"$nulls":7},{"$f":"IFERROR(VLOOKUP(I50,Élzárók!$A:$B,2),\"\")","v":""},{"$nulls":3},{"$f":"IFERROR(VLOOKUP(M50,Élzárók!$A:$B,2),\"\")","v":""}]
[null,{"$f":"IFERROR(VLOOKUP(A51,Bútorlapok!$A:$B,2),\"\")","v":""},{"$nulls":7},{"$f":"IFERROR(VLOOKUP(I51,Élzárók!$A:$B,2),\"\")","v":""},{"$nulls":3},{"$f":"IFERROR(VLOOKUP(M51,Élzárók!$A:$B,2),\"\")","v":""}]
[null,{"$f":"IFERROR(VLOOKUP(A52,Bútorlapok!$A:$B,2),\"\")","v":""},{"$nulls":7},{"$f":"IFERROR(VLOOKUP(I52,Élzárók!$A:$B,2),\"\")","v":""},{"$nulls":3},{"$f":"IFERROR(VLOOKUP(M52,Élzárók!$A:$B,2),\"\")","v":""}]
[null,{"$f":"IFERROR(VLOOKUP(A53,Bútorlapok!$A:$B,2),\"\")","v":""},{"$nulls":7},{"$f":"IFERROR(VLOOKUP(I53,Élzárók!$A:$B,2),\"\")","v":""},{"$nulls":3},{"$f":"IFERROR(VLOOKUP(M53,Élzárók!$A:$B,2),\"\")","v":""}]
[null,{"$f":"IFERROR(VLOOKUP(A54,Bútorlapok!$A:$B,2),\"\")","v":""},{"$nulls":7},{"$f":"IFERROR(VLOOKUP(I54,Élzárók!$A:$B,2),\"\")","v":""},{"$nulls":3},{"$f":"IFERROR(VLOOKUP(M54,Élzárók!$A:$B,2),\"\")","v":""}]
[null,{"$f":"IFERROR(VLOOKUP(A55,Bútorlapok!$A:$B,2),\"\")","v":""},{"$nulls":7},{"$f":"IFERROR(VLOOKUP(I55,Élzárók!$A:$B,2),\"\")","v":""},{"$nulls":3},{"$f":"IFERROR(VLOOKUP(M55,Élzárók!$A:$B,2),\"\")","v":""}]
[null,{"$f":"IFERROR(VLOOKUP(A56,Bútorlapok!$A:$B,2),\"\")","v":""},{"$nulls":7},{"$f":"IFERROR(VLOOKUP(I56,Élzárók!$A:$B,2),\"\")","v":""},{"$nulls":3},{"$f":"IFERROR(VLOOKUP(M56,Élzárók!$A:$B,2),\"\")","v":""}]
[null,{"$f":"IFERROR(VLOOKUP(A57,Bútorlapok!$A:$B,2),\"\")","v":""},{"$nulls":7},{"$f":"IFERROR(VLOOKUP(I57,Élzárók!$A:$B,2),\"\")","v":""},{"$nulls":3},{"$f":"IFERROR(VLOOKUP(M57,Élzárók!$A:$B,2),\"\")","v":""}]
[null,{"$f":"IFERROR(VLOOKUP(A58,Bútorlapok!$A:$B,2),\"\")","v":""},{"$nulls":7},{"$f":"IFERROR(VLOOKUP(I58,Élzárók!$A:$B,2),\"\")","v":""},{"$nulls":3},{"$f":"IFERROR(VLOOKUP(M58,Élzárók!$A:$B,2),\"\")","v":""}]
[null,{"$f":"IFERROR(VLOOKUP(A59,Bútorlapok!$A:$B,2),\"\")","v":""},{"$nulls":7},{"$f":"IFERROR(VLOOKUP(I59,Élzárók!$A:$B,2),\"\")","v":""},{"$nulls":3},{"$f":"IFERROR(VLOOKUP(M59,Élzárók!$A:$B,2),\"\")","v":""}]
[null,{"$f":"IFERROR(VLOOKUP(A60,Bútorlapok!$A:$B,2),\"\")","v":""},{"$nulls":7},{"$f":"IFERROR(VLOOKUP(I60,Élzárók!$A:$B,2),\"\")","v":""},{"$nulls":3},{"$f":"IFERROR(VLOOKUP(M60,Élzárók!$A:$B,2),\"\")","v":""}]
{"$rows_left_out":47}
{"sheet":"Bútorlapok","index":1,"n_rows":768,"n_cols":19,"rows_kept":768,"hidden":true}
["2970","Nyír rétegelt lemez csuszásmentes",2500,1250,27,"NEM",0,0,0,0,0,0,0,0,0,null,0,null,2970]
["37782","KAINDL 37782 Makassar",2800,2070,18,"IGEN",0,0,0,0,0,0,0,0,0,null,0,null,54650]
["40020","40020 Luc Tábla HT",2500,1000,18,"IGEN",0,0,0,0,0,0,0,0,0,null,0,null,40020]
["40300","40300 Borovi tábla HT A/A",2200,1200,18,"IGEN",0,0,0,0,0,0,0,0,0,null,0,null,40300]
["40310","40310 Borovi tábla HT A/A",2400,1200,18,"IGEN",0,0,0,0,0,0,0,0,0,null,0,null,40310]
["40311","40311 Borovi tábla HT A/A",2500,1200,18,"IGEN",0,0,0,0,0,0,0,0,0,null,0,null,40311]
["40312","40312 Borovi Tábla HT",2500,1200,18,"IGEN",0,0,0,0,0,0,0,0,0,null,0,null,40312]
["40315","40315 Borovi Tábla HT A/Akevert",3000,1200,18,"IGEN",0,0,0,0,0,0,0,0,0,null,0,null,40315]
["40318","40318 Borovi Tábla A/A",3000,1200,18,"IGEN",0,0,0,0,0,0,0,0,0,null,0,null,40318]
["40319","Borovi Fenyő HT 18x1200x3000",3000,1220,18,"IGEN",0,0,0,1000,10,1100,3660,1250,4575,null,0,null,281]
["40324","40324 Borovi Tábla HT.",3000,1200,24,"IGEN",0,0,0,0,0,0,0,0,0,null,0,null,40324]
["40327","40327 Borovi Tábla HT",2500,1200,24,"IGEN",0,0,0,0,0,0,0,0,0,null,0,null,40327]
["40330","40330 Borovi Tábla HT A/A",3000,1200,30,"IGEN",0,0,0,0,0,0,0,0,0,null,0,null,40330]
["40340","40340 Borovi Tábla HT A/A",3000,1200,40,"IGEN",0,0,0,0,0,0,0,0,0,null,0,null,40340]
["40341","40341 Borovi Tábla HT",2500,1200,40,"NEM",0,0,0,0,0,0,0,0,0,null,0,null,40341]
["40342","40342 Borovi Tábla HT",5100,1100,40,"IGEN",0,0,0,0,0,0,0,0,0,null,0,null,40342]
["40352","40352 Borovi Tábla HT A/A",2950,1200,18,"IGEN",0,0,0,0,0,0,0,0,0,null,0,null,40352]
["40365","40365 Borovi Tábla HT AB/AB Mix",3000,1200,18,"IGEN",0,0,0,0,0,0,0,0,0,null,0,null,40365]
["41018","41018 Luc Tábla TM B",3000,1220,18,"IGEN",0,0,0,0,0,0,0,0,0,null,0,null,41018]
["41021","41021 LUC TM",2500,1220,18,"IGEN",0,0,0,0,0,0,0,0,0,null,0,null,41021]
["41022","41022 LUC Táblásított",3000,1220,18,"IGEN",0,0,0,0,0,0,0,0,0,null,0,null,41022]
["41024","41024 Luc Tábla  B",3000,1220,24,"IGEN",0,0,0,0,0,0,0,0,0,null,0,null,41024]
["41316","41316 Borovi Tábla TM",2000,1200,18,"IGEN",0,0,0,0,0,0,0,0,0,null,0,null,41316]
["41318","41318 Borovi Tábla TM",2200,1200,18,"IGEN",0,0,0,0,0,0,0,0,0,null,0,null,41318]
["41319","41319 Borovi Tábla A/A TM",2400,1200,18,"IGEN",0,0,0,0,0,0,0,0,0,null,0,null,41319]
["41323","41323 Borovi Tábla",2200,1200,24,"IGEN",0,0,0,0,0,0,0,0,0,null,0,null,41323]
["41326","41326 Borovi Tábla TM",1900,1200,18,"IGEN",0,0,0,0,0,0,0,0,0,null,0,null,41326]
["41327","41327 Borovi Tábla TM",2100,1200,18,"IGEN",-2,0,0,0,0,0,0,0,0,null,0,null,41327]
["41332","41332 Borovi Tábla TM  A/A",2400,1200,32,"IGEN",0,0,0,0,0,0,0,0,0,null,0,null,41332]
["41333","41333 Borovi Tábla TM",3000,1200,24,"IGEN",0,0,0,0,0,0,0,0,0,null,0,null,41333]
["41334","41334 Boroví Tábla TM A/A",2500,1200,18,"IGEN",0,0,0,0,0,0,0,0,0,null,0,null,41334]
["41343","41343 Borovi TM",2500,1200,24,"IGEN",0,0,0,0,0,0,0,0,0,null,0,null,41343]
["41401","41401 Borovi Tábla",3000,1220,18,"IGEN",-4,0,0,0,0,0,0,0,0,null,0,null,41401]
["41402","41402 Boroví tábla",2500,1200,18,"IGEN",-13,0,0,0,0,0,0,0,0,null,0,null,41402]
["41406","41406 Borovi Tábla  TM",3600,1250,18,"IGEN",0,0,0,0,0,0,0,0,0,null,0,null,41406]
["41421","41421 Borovi Tábla TM B csomós",3000,1220,27,"IGEN",0,0,0,0,0,0,0,0,0,null,0,null,41421]
["41431","41431 Borovi Tábla  B/B",3000,1200,18,"IGEN",0,0,0,0,0,0,0,0,0,null,0,null,41431]
["41433","41433 Borovi Tábla TM Csómos",3000,1200,18,"IGEN",0,0,0,0,0,0,0,0,0,null,0,null,41433]
["41437","41437 Borovi Tábla",2500,1200,18,"IGEN",-1,0,0,0,0,0,0,0,0,null,0,null,41437]
["41439","41439 Borovi Tábla B",2500,1200,24,"IGEN",0,0,0,0,0,0,0,0,0,null,0,null,41439]
["41441","41441 Borovi Tábla B csomós",2500,1200,32,"IGEN",0,0,0,0,0,0,0,0,0,null,0]
["41443","41443 Borovi Tábla",2500,1200,18,"IGEN",0,0,0,0,0,0,0,0,0,null,0,null,41443]
["41503","41503 Borovi Tábla C/C kevert vágás",2400,1200,18,"IGEN",0,0,0,0,0,0,0,0,0,null,0,null,41503]
["41506","41506 Borovi Tábla TM C/C  csomós",3000,1200,20,"IGEN",0,0,0,0,0,0,0,0,0,null,0,null,41506]
["41602","41602 Gözölt Bükk TM A/B",2100,900,20,"IGEN",0,0,0,0,0,0,0,0,0,null,0,null,41602]
["41603","41603 Gőzölt Bükk TM A/B",1000,900,20,"IGEN",0,0,0,0,0,0,0,0,0,null,0,null,41603]
["41605","41605 Gözöltt Bükk Tábla",900,900,20,"IGEN",0,0,0,0,0,0,0,0,0,null,0,null,41605]
["41618","41623 Tölgy Tábla HT",900,920,30,"IGEN",0,0,0,0,0,0,0,0,0,null,0,null,41618]
["41620","Tölgy Tábla 41mm",2500,770,41,"IGEN",0,0,0,0,0,0,0,0,0,null,0]
["41623","41623 Tölgy tábla B/C",920,900,30,"IGEN",-3,0,0,0,0,0,0,0,0,null,0,null,41623]
["41634","41634 Bükk Tábla",2100,900,20,"IGEN",0,0,0,0,0,0,0,0,0,null,0,null,41634]
["41635","41635 Tölgy tábla",3000,1220,20,"IGEN",0,0,0,0,0,0,0,0,0,null,0,null,41605]
["42019","42019 Luc tábla 3R TM",5000,1250,19,"IGEN",-3,0,0,0,0,0,0,0,0,null,0,null,42019]
["50003","50003 Nyír rétegelt",1525,1525,3,"IGEN",0,0,0,0,0,0,0,0,0,null,0,null,50003]
["50004","5004 Nyír Rétegelt lemez",1520,1520,4,"IGEN",-1,0,0,0,0,0,0,0,0,null,0,null,50004]
["50005","50005 Nyír rétegelt lemez BB/CP",1525,1525,5,"IGEN",-4,0,0,0,0,0,0,0,0,null,0,null,50005]
["50006","50006 Nyír rétegelt lemez",1520,1520,6,"IGEN",0,0,0,0,0,0,0,0,0,null,0,null,50006]
["50010","50010 Nyír rétegelt 10mm",1525,1525,10,"IGEN",0,0,0,0,0,0,0,0,0,null,0]
["50012","50012 Nyír rétegelt lemez",1525,1525,12,"IGEN",0,0,0,0,0,0,0,0,0,null,0,null,50012]
["50015","50015 nyír rétegelt lemez",1525,1525,15,"IGEN",0,0,0,0,0,0,0,0,0,null,0,null,50015]
{"$rows_left_out":709}
{"sheet":"Élzárók","index":2,"n_rows":910,"n_cols":15,"rows_kept":910,"hidden":true}
["54990009 22x2","ABS5499009 22x2",2,0,0,0,0,0,0,0,0,0]
["5499009 22x04","ABS5499009 22x04",0.4,0,0,0,0,0,0,0,0,0]
["5499009 22x2","ABS5499009 22x2",2,0,0,0,0,0,0,0,0,0]
["5499010 22x04","ABS22x04",0.4,0,0,0,0,0,0,0,0,0]
["5499010 22x2","ABS22x2",2,0,0,0,0,0,0,0,0,0]
["5499011 22x2","ABS5499011 22x2",2,0,0,0,0,0,0,0,0,0]
["5499012 22x2","ABS5499012 22x2",2,0,0,0,0,0,0,0,0,0]
["5499014 22x2","ABS5499014 22x2",2,0,0,0,220,275,0,0,0,0]
["5499019 22x04","ABS 5499019 22x0,4",0.4,0,0,0,0,0,0,0,0,0]
["5499019 22x2","ABS 5499019 22x2 Verónai M.",2,0,0,0,0,0,0,0,0,0]
["5499031 22x2","ABS5499031 22x2",2,0,0,0,0,0,0,0,0,0]
["5499031 22×04","ABS5499031 22×0,4",0.4,0,0,0,0,0,0,0,0,0]
["5499032 04","ABS 5499032 0,4",0.4,0,0,0,0,0,0,0,0,0]
["5499032 22x2","ABS5499032 22x2",2,0,0,0,0,0,0,0,0,0]
["5499034 22x2","ABS 5499034 22x2",2,0,0,0,0,0,0,0,0,0]
["5499035 22x04","ABS5499035 22x0,4",0.4,0,0,0,0,0,0,0,0,0]
["5499035 22x2","ABS 5499035 22x2",0.4,0,0,0,0,0,0,0,0,0]
["ABAF238 22x2","ABS F238 22x2 Kastamonu",2,0,0,0,0,0,0,0,0,0]
["ABHU16012622x","ABSHU160126 22x2",2,0,0,0,0,0,0,0,0,0]
["ABS 106V 22/1","ABS 22/ 1 Fényes Zebráno",1,0,0,0,0,0,0,0,0,0]
["ABS 310 22×1","ABS F 310 Rozsda Kerámia HD 29310   22×1",2,0,0,0,0,0,0,0,0,0]
["ABS 353 22×2","ABS A353 22×2    HD 24354",2,0,0,0,0,0,0,0,0,0]
["ABS 3753 22x0","Élléc 42x2mm Tölgy",2,0,0,0,0,0,0,0,0,0]
["ABS 546045","ABS 546045  22×1 Magasfényű Antracit",1,0,0,0,0,0,0,0,0,0]
["ABS 546115","ABS 546115 Magasfényű Akác 22×1",1,0,0,0,0,0,0,0,0,0]
["ABS 546125","ABS 546125 Magasfényű Német Tölgy 22×1",1,0,0,0,0,0,0,0,0,0]
["ABS 8944 22×2","ABS KRONO 8944 22×2   HD 228944",2,0,0,0,0,0,0,0,0,0]
["ABS akác 22x2","ABS22x2",2,0,0,0,0,0,0,0,0,0]
["ABS F239 22×1","ABS F239  22×1 Beige Trend",1,0,0,0,0,0,0,0,0,0]
["ABS F854",null,0,0,0,0,0,0,0,0,0,0]
["ABS Hozott","Hozott élanyag",0,0,0,0,0,0,0,0,0,0]
["ABS HU15532","ABS HU 15532",1,0,0,0,0,0,0,0,0,0]
["ABS Ivory Oak","ABS 22x1 Shinnoky Ivory Oak",1,0,0,0,0,0,0,0,0,0]
["ABS S2020-Y","ABS 22x1,3mm S2020-Y 60 R",1,0,0,0,0,0,0,0,0,0]
["ABS01020 22x1","ABS01020 22x1",1,0,0,0,0,0,0,0,0,0]
["ABS0251L","ABS0251 L 22x1",1,0,0,0,0,0,0,0,0,0]
["ABS0287L","ABS0287L",1,0,0,0,0,0,0,0,0,0]
["ABS0291L 22x1","ABS0291 L 22x1",1,0,0,0,0,0,0,0,0,0]
["ABS0329L","ABS0329L NCSS1010-Y30R",1,0,0,0,0,0,0,0,0,0]
["ABS0330L22x1","ABS0330L 22x1mm",1,0,0,0,0,0,0,0,0,0]
["ABS0332L 22x1","ABS0332L 22x1",1,0,0,0,0,0,0,0,0,0]
["ABS0334 L","ABS0334L 22x1",1,0,0,0,0,0,0,0,0,0]
["ABS0339L 22x1","ABS0339L 22x1",1,0,0,0,0,0,0,0,0,0]
["ABS0340L 22x1","ABS0340L 22x1",1,0,0,0,0,0,0,0,0,0]
["ABS0341L","ABS0341L 22x1",1,0,0,0,0,0,0,0,0,0]
["ABS0794 22x2","ABS0794 22x2 Platina Bronz",2,0,0,0,0,0,0,0,0,0]
["ABS102 22x04","ABS102 22x04 14481",0.4,0,0,0,0,0,0,0,0,0]
["ABS102 22x2","ABS 22x2mm 14481",2,0,0,0,0,0,0,0,0,0]
["ABS104 22x2","ABS 22x2mm Alabástrom",2,0,0,0,0,0,0,0,0,0]
["ABS104 22×0,4","ABS U104 22×0,4",0.4,0,0,0,0,0,0,0,0,0]
["ABS107 22x2","ABS107 22x2 B",2,0,0,0,0,0,0,0,0,0]
["ABS1129 22x04","ABS1129 22x04 HD241129",0.4,0,0,0,0,0,0,0,0,0]
["ABS1129 22x2","ABS1129 22x2 HD241129",2,0,0,0,0,0,0,0,0,0]
["ABS113 22×0,4","ABS U113 Gyöngyfehér 22×0,4  HU12514",0.4,0,0,0,0,0,0,0,0,0]
["ABS113 22×2","ABS U113 Gyöngyfehér 22×2  HU12514",2,0,0,0,0,0,0,0,0,0]
["ABS1137 22x04","ABS 22x0,4mm",0.4,0,0,0,0,0,0,0,0,0]
["ABS1137 22x2","ABS 22x2mm",2,0,0,0,0,0,0,0,0,0]
["ABS1145 22x04","ABS1145 22x04 HD241145",0.4,0,0,0,0,0,0,0,0,0]
["ABS1145 22x2","ABS1145 22x2 HD241145",0,0,0,0,0,0,0,0,0,0]
["ABS1151 42x2","ABS1151 42x2 HD241151",2,0,0,0,0,0,0,0,0,0]
{"$rows_left_out":850}